Report created on Fri Mar 6 06:02:06 2015. back to main menu

For explanatory information and summary details, see the notes below.

Problem Reports explanation portname state responsible
198337: pkg version reporting incorrect results for python3 sqlite3 module framework   New
198335: [MAINTAINER] www/piwik: update to 2.11.2 existing www/piwik New
198333: [PATCH] ftp/pavuk Fix build WITHOUT_SSL2 and with LibreSSL existing ftp/pavuk New
198332: net-p2p/deluge: New twisted incompatibility existing net-p2p/deluge New
198331: Maintainer update: biology/ncbi-blast+: Add dependency require by existing biology/ncbi-blast+ New
198330: [PATCH] graphics/openimageio Missing dependency on OpenSSL existing graphics/openimageio New
198329: graphics/graphviz: unbreak RUBY option existing graphics/graphviz New
198328: security/gnutls: add CPE information existing security/gnutls New
198327: math/gnumeric: add CPE information existing math/gnumeric New
198326: devel/gcc-arm-embedded: add CPE information existing devel/gcc-arm-embedded New
198325: devel/powerpc64-gcc: add CPE information existing devel/powerpc64-gcc New
198324: Mk/ speed up "make clean" framework   New
198323: security/cyrus-sasl2: make local DB-errors more descriptive existing security/cyrus-sasl2 New
198322: [patch] shells/fish: include builtin manpages existing shells/fish New
198321: sysutils/moreutils 0.53 conflicts with security/openssl 1.0.1_18 existing sysutils/moreutils New
198319: [maintainer update] graphics/converseen to 0.9.1 existing graphics/converseen New
198318: net-mgmt/nagios-plugins: check_dhcp segfaults in command line parser existing net-mgmt/nagios-plugins New
198317: [NEW PORT] x11/tint-devel new x11/tint-devel New
198316: [NEW PORT] deskutils/py-vdirsyncer: synchronize calendars and contacts new deskutils/py-vdirsyncer New
198315: net/relayd does not work with ssl services existing net/relayd New
198312: sysutils/lsof: No longer builds after head/r279433 existing sysutils/lsof New
198311: shells/jailkit: update to 2.17 existing shells/jailkit New
198309: [MAINTAINER] upgrade net-mgmt/netdisco to v2 existing net-mgmt/netdisco New
198308: [NEW PORTS] p5 ports needed by netdisco v2 unknown   New
198306: www/youtube_dl SSL: CERTIFICATE_VERIFY_FAILED existing www/youtube_dl New
198304: [patch] devel/cutter: Update to 1.2.4 existing devel/cutter New
198303: maintainer update of mail/mutt existing mail/mutt Open
198302: net/ntopng: Doesn't build on -HEAD existing net/ntopng Open
198301: japanese/sj3-server sj3.c:1359: error: expected declaration or statement at end of input existing japanese/sj3-server New
198300: mail/qpopper: fix NO_QPOPAUTH install [PATCH] existing mail/qpopper New
198297: update mail/davmail to 4.6.0 existing mail/davmail New
198296: math/fftw3: upgrade, fix the "SSE but not SSE2" systems existing math/fftw3 New
198295: www/glpi: 0.85.2 [maintainer update] existing www/glpi Open
198294: [MAINTAINER] print/cups-filters: update to 1.0.66 existing print/cups-filters Open
198293: dns/opendnssec: bind UDP dnssec failing existing dns/opendnssec New
198292: [maintainer] biology/samtools: update to 1.2 existing biology/samtools Open
198291: [maintainer] biology/htslib: Update to 1.2.1 existing biology/htslib Open
198287: sysutils/cdrtools-devel (cc), : exited on signal 6 (core dumped) existing sysutils/cdrtools-devel New
198286: multimedia/kodi don't compile from ports existing multimedia/kodi New
198280: graphics/qgis: Missing SAGA toolbox in "Processing Toolbox" after upgrading QGIS to 2.8.1 existing graphics/qgis New
198278: [MAINTAINER] print/fontforge: Update to 20150228 existing print/fontforge Open
198277: [MAINTAINER UPDATE] [patch] x11/virtualgl to 2.4 existing x11/virtualgl New
198274: www/squidclamav: outdated port existing www/squidclamav New
198272: [exp-run] Identify if_media.h consumers in ports framework   Open
198270: [PATCH] Mk/ update for LibreSSL 2.1.4 framework   New
198268: [PATCH] security/libressl update to 2.1.4 existing security/libressl New
198267: sysutils/and take MAINTAINER'ship existing sysutils/and New
198265: [PATCH] www/www6to4: trim @dirrmtry existing www/www6to4 New
198264: sysutils/cramfs take MAINTAINER'ship existing sysutils/cramfs New
198263: security/fakeident: move source to files, use rc structure existing security/fakeident New
198262: net/samba36: add timeout option existing net/samba36 New
198260: lang/gcc5: add CPE information existing lang/gcc5 New
198259: lang/gcc49: add CPE information existing lang/gcc49 New
198258: lang/gcc48: add CPE information existing lang/gcc48 New
198256: lang/gcc47: add CPE information existing lang/gcc47 New
198255: lang/gcc46: add CPE information existing lang/gcc46 New
198253: sysutils/cdrtools build causes: exited on signal 6 (core dumped) existing sysutils/cdrtools New
198251: Remove ports-mgmt/portmaster pkg-message pkgng suggestion existing ports-mgmt/portmaster New
198250: devel/p5-AppConfig: Update to 1.71 existing devel/p5-AppConfig New
198249: lang/gcc: add CPE information existing lang/gcc New
198248: print/enscript-letter: add CPE information existing print/enscript-letter New
198247: mail/p5-Mail-Tools: Update to 2.14 existing mail/p5-Mail-Tools New
198246: net/samba36: build without LDAP and ADS fails, if EXP_MODULES is on existing net/samba36 New
198245: sysutils/geomgui FIXES MASTER_SITES, and WWW existing sysutils/geomgui New
198243: [PATCH] deskutils/growl-for-linux replace deprecated des_ methods with DES_ existing deskutils/growl-for-linux In Progress
198241: graphics/gimp: add CPE information existing graphics/gimp New
198240: graphics/gimp-app: add CPE information existing graphics/gimp-app New
198239: editors/emacs-devel: add CPE information existing editors/emacs-devel New
198238: editors/emacs: add CPE information existing editors/emacs New
198237: devel/ddd: add CPE information existing devel/ddd New
198235: sysutils/coreutils: add CPE information existing sysutils/coreutils New
198234: games/gnuchess: add CPE information existing games/gnuchess New
198233: lang/clang-devel : Fix scan-build existing lang/clang-devel New
198232: devel/kBuild: fix build with clang [PATCH] existing devel/kBuild New
198230: sysutils/aimage take MAINTAINERship add LICENSE existing sysutils/aimage New
198229: devel/ruby-build: update to 20150303 existing devel/ruby-build New
198227: devel/adacurses : remove dependency on ncurses if possible existing devel/adacurses New
198220: [MAINTAINER] www/node-0.10 for stable node.js 0.10.x unknown   Open
198218: [UPDATE] port "games/armagetron" to v0. existing games/armagetron New
198217: games/minecraft-server: avoid java-args.txt if DAEMON [PATCH] existing games/minecraft-server New
198215: mail/postfix: wrong permission for /var/db/postfix existing mail/postfix New
198213: sysutils/monitorix: pkg-static: Malformed keyword dir, wrong mode section existing sysutils/monitorix Open
198212: [PATCH] databases/mongodb allow custom config path existing databases/mongodb New
198209: Fix games/cataclysm-dda build with clang 3.6.0 existing games/cataclysm-dda New
198207: Fix mail/milter-manager build with clang 3.6.0 existing mail/milter-manager New
198206: Fix games/stepmania-devel build with clang 3.6.0 existing games/stepmania-devel New
198195: devel/protobuf-c: disable DOXYGEN by default existing devel/protobuf-c Open
198194: Fix net/shadowsocks-libev build with clang 3.6.0 existing net/shadowsocks-libev New
198193: devel/automake14: add CPE information and Makefile fix existing devel/automake14 New
198192: [update] multimedia/livestreamer to 1.12.0 existing multimedia/livestreamer New
198191: devel/automake: add CPE information existing devel/automake New
198187: textproc/aspell: add CPE information existing textproc/aspell New
198176: print/a2ps: add CPE information existing print/a2ps New
198175: devel/gdb: add CPE information existing devel/gdb New
198167: java/java-zoneinfo: installs superseded version of data existing java/java-zoneinfo New
198166: misc/zoneinfo: is not kept up-to-date existing misc/zoneinfo New
198165: ports-mgmt/pkg: pkg upgrade, cannot solve job using SAT solver existing ports-mgmt/pkg New
198164: security/tor: properly handle config file existing security/tor New
198150: PHP 53 - 6 months EOL - this should not be in ports framework   New
198146: [devel/gdb] Added 'make check' to run gdb testsuite existing devel/gdb New
198144: security/openssh-portable: fix security/heimdal detection after UPDATING-20141123 existing security/openssh-portable New
198142: [mail/thunderbird] plays no notification sound existing mail/thunderbird New
198141: Fix devel/pecl-ev build with clang 3.6.0 existing devel/pecl-ev New
198140: Fix devel/pecl-eio build with clang 3.6.0 existing devel/pecl-eio New
198138: www/php5-tidy: adding an option to use tidy-html5 existing www/php5-tidy New
198137: devel/tradcpp : possible source of FreeBSD 11 regressions existing devel/tradcpp New
198136: ftp/curl: Fix build with security/heimdal after UPDATING-20141123 existing ftp/curl Open
198133: graphics/opencv-core fails to build on powerpc64 existing graphics/opencv-core New
198132: [exp-run] Update Xfce to 4.12.0 framework   Open
198131: [patch] update textproc/p5-Text-VimColor to 0.25 existing textproc/p5-Text-VimColor New
198123: [exp-run] improve textproc/intltool with USES=autoreconf existing textproc/intltool New
198116: [patch] graphics/gdal : don't substitute -lpthread with -pthread anymore existing graphics/gdal New
198112: Fix www/mod_spdy build with clang 3.6.0 existing www/mod_spdy New
198111: [PATCH] security/p5-Crypt-SMIME Fix OpenSSL dependency existing security/p5-Crypt-SMIME New
198110: multimedia/xbmc-addon-pvr: cleanup existing multimedia/xbmc-addon-pvr New
198108: New port: devel/p5-Scalar-Util-Numeric (Numeric tests for perl scalars) new devel/p5-Scalar-Util-Numeric New
198107: New port: devel/p5-Data-HexDump-Range (Hexadecimal Range Dumper with color, bitfields and skip ranges) new devel/p5-Data-HexDump-Range New
198105: New port: shells/p5-Term-Bash-Completion-Generator (Generate bash completion scripts) new shells/p5-Term-Bash-Completion-Generator New
198100: New port: devel/p5-Tree-Trie (Data structure optimized for prefix lookup) new devel/p5-Tree-Trie New
198099: New port: textproc/p5-Text-Colorizer (Create colored text) new textproc/p5-Text-Colorizer New
198089: New port: www/squid35 new www/squid35 In Progress
198088: [PATCH] graphics/djview4: Update to 4.10 existing graphics/djview4 New
198087: [PATCH] graphics/djvulibre: Update to 3.5.27 existing graphics/djvulibre New
198086: java/jdk8-doc port maintainer needs to update port for new docs existing java/jdk8-doc New
198082: [new ports] databases/linux-oracle-12-instantclient-basic, -sdk, -sqlplus, release 12 of instantclient ports new databases/linux-oracle-12-instantclient-basic New
198080: security/tor patch to fix IPFW transparent proxy support existing security/tor New
198076: [patch] devel/hg-git: Update to 0.8.0 existing devel/hg-git New
198075: devel/ioncube: update to 4.7.4 existing devel/ioncube New
198074: New port: russian/rux Cyrillic text viewer and code page converter new russian/rux New
198073: [NEW PORT] databases/influxdb: Open-source distributed timeseries database new databases/influxdb New
198072: net-p2p/libtorrent-rasterbar - Needs linking with converters/libiconv existing net-p2p/libtorrent-rasterbar New
198071: emulators/virtualbox-ose-kmod: vboxdrv confusing geom existing emulators/virtualbox-ose-kmod New
198069: www/rt40: Update to 4.0.23 existing www/rt40 New
198068: net-im/ktp-text-ui doesn't display chat history existing net-im/ktp-text-ui New
198067: net-mgmt/xymon-client: rc script kills unrelated processes existing net-mgmt/xymon-client In Progress
198066: x11-toolkits/libgdiplus: Fails to build on 10.1-RELEASE jail in poudriere. existing x11-toolkits/libgdiplus New
198064: net/samba41: 4.1.17 seems to change necessary rc.conf option for winbindd existing net/samba41 New
198063: [New port] devel/gitlist - GitList is a web based git repository browser written in PHP similar to GitHub new devel/gitlist New
198061: x11-fonts/fira: unnecessary dependency on x11 existing x11-fonts/fira New
198060: irc/znc: update to 1.6.0 existing irc/znc New
198059: [PATCH] sysutils/s6: update to existing sysutils/s6 New
198058: [PATCH] lang/execline: update to existing lang/execline New
198057: devel/skalibs: update to existing devel/skalibs New
198056: print/py-fonttools: Update to version 2.5 existing print/py-fonttools New
198053: [new port] databases/p5-DBD-mysql55 new databases/p5-DBD-mysql55 New
198052: devel/ruby-gems: fails to build with ruby 2.2 existing devel/ruby-gems New
198051: [MAINTAINER] net-mgmt/pandorafms_*: Update to 5.1SP2 unknown   Open
198046: [update] www/moinmoin: Update version 1.9.7 -> 1.9.8 existing www/moinmoin New
198045: Build tools hiding dependency issues framework   New
198044: mail/squirrelmail: leftover config.php file existing mail/squirrelmail New
198042: [MAINTAINER] security/maia: Update to 1.0.4, Lots of PERL fixes existing security/maia In Progress
198041: [patch] dependency change for math/p5-Math-Random-ISAAC-XS existing math/p5-Math-Random-ISAAC-XS New
198036: security/gnupg: hidden dependency on devel/readline existing security/gnupg Open
198034: [patch] devel/py-zope.deprecation: Update to 4.1.2 existing devel/py-zope.deprecation In Progress
198033: [patch] www/py-pastedeploy: update to 1.5.2 existing www/py-pastedeploy New
198032: x11-fm/xfe: Text disappears from buttons and directory items existing x11-fm/xfe New
198031: [PATCH] x11-wm/obmenu execute actions have empty command existing x11-wm/obmenu New
198029: mail/spamassassin : fails to configure with gcc-5 existing mail/spamassassin New
198028: lang/perl5.18: Missing license file for ART10 in /usr/ports/lang/perl5.18/work/perl-5.18.4/Artistic existing lang/perl5.18 Open
198027: devel/gmake-lite fails on make package-recursive if bash-static is installed existing devel/gmake-lite New
198025: [PATCH][REVIVE] textproc/xxdiff & textproc/xxdiff-scripts: Update to 4.0 new textproc/xxdiff New
198022: editors/emacs-devel: add lldb support existing editors/emacs-devel In Progress
198021: [patch] net/serviio: Export a JAVA_VERSION to handle when multiple Java versions are installed existing net/serviio New
198019: [PATCH]: FreeBSD 10.1 fix for comms/telldus-core existing comms/telldus-core New
198017: Fix security/libtomcrypt build with clang 3.6.0 existing security/libtomcrypt New
198013: Update math/lapack to version 3.5.0 existing math/lapack New
198012: net/samba41: Recent update fails on CURRENT existing net/samba41 In Progress
198011: Fix devel/rcs build with clang 3.6.0 existing devel/rcs New
198008: sysutils/py-salt broke when updated to 2014.7.2 (Related with #197597) existing sysutils/py-salt New
198006: Fix devel/ with clang 3.6.0 existing devel/ New
198005: [MAINTAINER] net-mgmt/zabbix24-server: Update to 2.4.4 existing net-mgmt/zabbix24-server Open
198000: games/linux-ut: optionize, fix checks existing games/linux-ut New
197999: devel/hub: update to 2.2.0 existing devel/hub New
197998: security/tor: rcorder: requirement `USR' in file `/usr/local/etc/rc.d/tor' has no providers. existing security/tor New
197995: math/gnuplot: hidden dependency on devel/readline existing math/gnuplot New
197992: [New port] databases/postgresql92-1c new databases/postgresql92-1c New
197990: x11/kde4-workspace: crash of plasma-desktop due to GLIBCXX_3.4.15 version not found existing x11/kde4-workspace New
197985: error when install mail/openwebmail existing mail/openwebmail Open
197974: [PATCH]: Update dns/knot to 1.6.2 existing dns/knot New
197972: lang/python27 fails due to error "./ undefined reference to `sincos'" existing lang/python27 Open
197971: [patch] x11/xdm: add CPE information existing x11/xdm New
197970: [patch] x11-drivers/xf86-video-intel: add CPE information existing x11-drivers/xf86-video-intel New
197969: [patch] x11/libXxf86vm: add CPE information existing x11/libXxf86vm New
197968: [patch] x11/libXxf86dga: add CPE information existing x11/libXxf86dga New
197967: [patch] x11/libXvMC: add CPE information existing x11/libXvMC New
197966: [patch] x11/libXv: add CPE information existing x11/libXv New
197965: [patch] x11/libXtst: add CPE information existing x11/libXtst New
197964: [patch] x11-toolkits/libXt: add CPE information existing x11-toolkits/libXt New
197963: [patch] x11/libXres: add CPE information existing x11/libXres New
197962: [patch] x11/libXrandr: add CPE information existing x11/libXrandr New
197961: sysutils/fusefs-s3fs: update to 1.78 existing sysutils/fusefs-s3fs New
197960: devel/awscli: update to 1.7.11 existing devel/awscli New
197959: [patch] x11/libXp: add CPE information existing x11/libXp New
197958: [MAINTAINER] graphics/p5-Image-Scale: Fix BROKEN disable gif support existing graphics/p5-Image-Scale Open
197956: www/linux-c6-flashplugin11 version 11.2r202.442 compile problems existing www/linux-c6-flashplugin11 New
197951: [patch] update graphics/py-pyglet to 1.2.0 existing graphics/py-pyglet New
197949: textproc/elasticsearch service stop not working existing textproc/elasticsearch New
197947: [patch] editors/libreoffice : fix build on gcc-5 existing editors/libreoffice New
197946: graphics/darktable error flood dbus COLORD existing graphics/darktable New
197942: devel/libclc fails to install with error "libclc-0.0.1.r222830 Does not build, missing header" existing devel/libclc New
197941: mail/cclient segmentation fault existing mail/cclient New
197940: games/openra (also lang/mono ): Crashes on load with apparent Mono runtime error existing games/openra Open
197938: New port: lang/tcbasic - Small BASIC Interpreter written in C. new lang/tcbasic New
197937: security/suricata : a few fixes existing security/suricata New
197935: [PATCH] Update Tryton 2.4 ports to latest patch level and add DEPRECATED / EXPIRATION_DATE existing finance/tryton In Progress
197931: [UPDATE] java/netbeans to v8.0.2 existing java/netbeans New
197930: www/firefox: does not build with 10.1-RELEASE existing www/firefox New
197929: mail/p5-Email-FolderType: should depend on devel/p5-Module-Pluggable existing mail/p5-Email-FolderType New
197926: emulators/qemu-user-static fails due to syntax error in config-host.ld:14 existing emulators/qemu-user-static Open
197925: multimedia/hs-gstreamer : fails to build with gcc5-built ghc existing multimedia/hs-gstreamer In Progress
197924: x11-toolkits/hs-gtk : fails to build with gcc5-built ghc existing x11-toolkits/hs-gtk In Progress
197920: [patch] shells/pdksh : fails to build on gcc5 due to cpp, here is fix existing shells/pdksh New
197919: port [ports-mgmt/portupgrade] does not build with Ruby-2.2 (issues on related port [databases/ruby-bdb]) existing ports-mgmt/portupgrade In Progress
197916: [sysutils/hal] hald doesn't create records for ZFS mount points existing sysutils/hal New
197913: [patch] update www/p5-Mojolicious-Plugin-YamlConfig to 0.2.0 existing www/p5-Mojolicious-Plugin-YamlConfig New
197911: [patch] net/wpa_gui: Update distfile URL existing net/wpa_gui New
197910: devel/ninja: MAKE_JOBS behavior differs from make existing devel/ninja New
197909: security/obfsclient fails to build with GCC 4.9 existing security/obfsclient New
197908: lang/clang-devel fails to build when we default to GCC 4.9 existing lang/clang-devel New
197907: graphics/openimageio fails to build when USE_GCC=yes implies GCC 4.9 existing graphics/openimageio In Progress
197906: graphics/vips fails to build when USE_GCC=yes implies GCC 4.9 existing graphics/vips Open
197905: graphics/nvidia-texture-tools fails to build when USE_GCC=yes implies GCC 4.9 existing graphics/nvidia-texture-tools New
197903: graphics/luxrender fails to build when USE_GCC=yes implies GCC 4.9 existing graphics/luxrender New
197901: graphics/luminance fails to build when USE_GCC=yes implies GCC 4.9 existing graphics/luminance New
197897: graphics/lprof-devel fails to build when USE_GCC=yes implies GCC 4.9 existing graphics/lprof-devel New
197895: graphics/fyre fails to build when USE_GCC=yes implies GCC 4.9 existing graphics/fyre New
197894: graphics/exact-image fails to build when USE_GCC=yes implies GCC 4.9 existing graphics/exact-image New
197893: graphics/cinepaint fails to build when USE_GCC=yes implies GCC 4.9 existing graphics/cinepaint New
197892: graphics/aqsis fails to build when USE_GCC=yes implies GCC 4.9 existing graphics/aqsis New
197891: graphics/ampasCTL fails to build when USE_GCC=yes implies GCC 4.9 existing graphics/ampasCTL New
197889: editors/calligra fails when default version of GCC is 4.9 (or higher): /usr/local/lib/ undefined reference to `std::__throw_out_of_range_fmt(char const*, ...)@GLIBCXX_3.4.20' existing editors/calligra New
197888: devel/codeblocks crash on startup with coredump existing devel/codeblocks New
197885: [update] Diff for committing upgrade mail/alpine 2.11 > 2.20 existing mail/alpine New
197884: System with zfs freezes if emulators/virtualbox-ose got all ram existing emulators/virtualbox-ose New
197883: [patch] databases/postgis21: 2.1.5 port is missing upgrade scripts for postgis 2.1.3 and 2.1.4 existing databases/postgis21 New
197879: astro/gpsbabel: update to 1.5.2 (PATCH) existing astro/gpsbabel New
197877: math/maxima install 5.35.1 as ports existing math/maxima New
197871: sysutils/ksysguardd: cannot open configuration file existing sysutils/ksysguardd New
197870: [PATCH] Update Tryton 2.8 modules to latest versions (finance/tryton* etc.) existing finance/tryton In Progress
197867: Fix devel/libeio build with clang 3.6.0 existing devel/libeio New
197860: [PATCH]: Update net/micro_inetd to 2014.08.14 existing net/micro_inetd Open
197855: [PATCH]: Update security/tor-devel to existing security/tor-devel New
197854: security/sshguard patch to trigger on syslog entries with existing security/sshguard In Progress
197853: [patch] devel/qt4-assistant : fix configure to support gcc-5 existing devel/qt4-assistant New
197850: audio/portaudio: cleanup existing audio/portaudio New
197840: emulators/virtualbox-ose-additions: seamless mode don't work on FreeBSD Guest i386 existing emulators/virtualbox-ose-additions New
197839: [PATCH]: Update security/tor-devel to, remove deprecated config options existing security/tor-devel New
197837: mail/spamassassin dependency on gpg1 existing mail/spamassassin New
197836: mail/spamassassin install failing on 9.3 with default Perl existing mail/spamassassin New
197834: new port: devel/pyscard: smart card support for python new devel/pyscard New
197833: [maintainer update] [patch] www/mod_security: update to 2.9.0 existing www/mod_security Open
197831: devel/valgrind on stable/10: binary package still needs updating due to openat() existing devel/valgrind New
197828: [update] emulators/pipelight to 2.8 existing emulators/pipelight New
197826: [MAINTAINER] russian/wordpress: Update to 4.1.1 existing russian/wordpress Open
197825: new port: devel/acsccid:driver for acs smart card readers new devel/acsccid New
197823: science/massxpert : logic bug revealed by gcc5 existing science/massxpert New
197822: www/trac-batchmodify: Mark as deprecated existing www/trac-batchmodify In Progress
197820: update: misc/vifm to 0.7.8 existing misc/vifm New
197816: sysutils/pftop: doesn't compile on -CURRENT with GCC (MIPS64) existing sysutils/pftop New
197815: multimedia/libass: update to 0.12.1 existing multimedia/libass New
197805: [feature request] ports-mgmt/portmaster: special handling of sudo existing ports-mgmt/portmaster New
197798: [PATCH] emulators/wine-devel: Add Wine64 support existing emulators/wine-devel In Progress
197795: math/cln: fails to build on armv6 existing math/cln New
197794: sysutils/cdrtools: fails to build on armv6 existing sysutils/cdrtools New
197793: security/gnupg1: fails to build on armv6 existing security/gnupg1 New
197784: [new port] net/openbsc: GSM network in a box software new net/openbsc New
197780: [UPDATE] security/polarssl: update to 1.2.13 existing security/polarssl New
197779: [UPDATE] security/polarssl13: update to 1.3.10 existing security/polarssl13 New
197775: net/rtpproxy: rc.d script needs improvements existing net/rtpproxy New
197774: multimedia/handbrake fails during build of internal x264 library existing multimedia/handbrake New
197757: lang/python27, lang/python32 and lang/python33: pythonX.Y-config --ldflags missing -L/usr/local/lib when NLS option turned off existing lang/python27 New
197754: devel/libgtop: configure error existing devel/libgtop New
197751: [exp-run] Update KDE SC to 4.14.3 framework   Open
197749: [patch] graphics/exiv2 : not jobs safe, patch fixes it existing graphics/exiv2 New
197748: ports-mgmt/pkg: ignores error conditions at exit time existing ports-mgmt/pkg New
197747: ports-mgmt/portlint : request to warn on patches that don't have UTC in "---" line existing ports-mgmt/portlint New
197744: [patch] x11/libXinerama: add CPE information existing x11/libXinerama New
197742: [patch] update www/p5-Plack to 1.0034 existing www/p5-Plack New
197741: [patch] x11/libXi: add CPE information existing x11/libXi New
197740: [patch] update devel/p5-POSIX-strftime-Compiler to 0.41 existing devel/p5-POSIX-strftime-Compiler New
197738: [patch] x11-fonts/libXfont: add CPE information existing x11-fonts/libXfont New
197736: [patch] x11/libXfixes: add CPE information existing x11/libXfixes New
197734: [patch] x11/libXext: add CPE information existing x11/libXext New
197732: [patch] x11/libXcursor: add CPE information existing x11/libXcursor New
197731: [patch] update www/p5-HTTP-Parser-XS to 0.17 existing www/p5-HTTP-Parser-XS New
197724: [patch] x11/libxcb: add CPE information existing x11/libxcb New
197718: [patch] x11-fonts/libFS: add CPE information existing x11-fonts/libFS New
197717: [patch] x11/libdmx: add CPE information existing x11/libdmx New
197716: [patch] x11/libX11: add CPE information existing x11/libX11 New
197714: [patch] update converters/p5-Sereal and friends to 3.005 existing converters/p5-Sereal New
197712: [patch] x11-servers/xorg-server: add CPE information existing x11-servers/xorg-server New
197711: [patch] devel/boost-all: add CPE information existing devel/boost-all New
197703: security/ipsec-tools: build fails on 8.4-RELEASE existing security/ipsec-tools In Progress
197700: net/vinagre: fails to build on 10.1-RELEASE existing net/vinagre New
197699: mail/mutt: regression due to switch to base iconv existing mail/mutt Open
197698: x11-toolkits/p5-Wx: Links to wrong stdc++ library existing x11-toolkits/p5-Wx New
197687: [MAINTAINER] www/vimb: Split into www/vimb-gtk{2,3} ports, Delete www/vimb, Update to 2.9 existing www/vimb Open
197682: [NEW PORT] devel/py-autopep8: Automatically formats Python code to PEP8 style guide new devel/py-autopep8 New
197679: databases/mariadb-server builds on FreeBSD 10.1-RELEASE existing databases/mariadb-server New
197674: [PATCH] mail/rainloop: update to 1.8.1 existing mail/rainloop New
197671: www/webkit-gtk3: Broken on gcc5 and pushes clang-only cxx-flags existing www/webkit-gtk3 New
197670: ports-mgmt/pkg should pipe package installation messages through less when there are lots of them existing ports-mgmt/pkg New
197669: www/webkit-gtk2: Broken on gcc5 and pushes clang-only cxx-flags existing www/webkit-gtk2 New
197667: [patch] textproc/p5-xmltv: tv_grab_na_dd download website has changed existing textproc/p5-xmltv New
197651: [patch] update textproc/p5-Text-CSV_XS to 1.15 existing textproc/p5-Text-CSV_XS New
197613: Mk/ sync INSTALL_* comments with Porter's Handbook framework   New
197605: games/{assaultcube,bloodfrontier,redeclipse,sauerbraten}: unbundle libenet unknown   In Progress
197603: graphics/libglapi requires libdrm >= 2.4.24, but graphics/libglapi/Makefile doesn't specify a particular version existing graphics/libglapi New
197596: www/nginx: HTTP_AUTH_LDAP doesn't seem to work existing www/nginx New
197595: textproc/elasticsearch: upgrade to 1.4.3 and add plugins directory existing textproc/elasticsearch New
197594: devel/boost-libs: bad c++11, won't build with gcc5 existing devel/boost-libs New
197589: science/py-scimath: Fix (add) dependency, Mark UnBROKEN existing science/py-scimath Open
197588: [MAINTAINER] www/MT,russian/MT: update 5.2.12 existing www/MT New
197584: [PATCH] graphics/darktable: Add SSE2 instructions for old machines existing graphics/darktable New
197583: games/sauerbraten: convert to option helpers and dependency fixes existing games/sauerbraten New
197582: games/assaultcube: convert to option helpers and dependency fixes existing games/assaultcube Open
197577: devel/nspr: Has no mips/mips64 knowledge existing devel/nspr New
197576: [arm] lang/libobjc2 on ARM does not build the correct exception code. existing lang/libobjc2 New
197572: www/py-pyramid: Add LICENSE and take MAINTAINER'ship existing www/py-pyramid In Progress
197568: multimedia/clutter-gst fails on ClutterGst-2.0.gir existing multimedia/clutter-gst New
197562: security/libgpg-error : fails to build on gcc-5 due to new cpp functionality existing security/libgpg-error Open
197559: pkg2ng complains about /usr/ports/Keywords/srcdir.ucl framework   New
197553: multimedia/webcamd: REQUIRE dbus BEFORE devd creates circular rcorder dependency existing multimedia/webcamd New
197552: sysutils/fsc: Creates a circular rcorder dependency. existing sysutils/fsc New
197548: graphics/dri: Missing dependency - multimedia/v4l_compat existing graphics/dri New
197546: japanese/lynx-current: Add CPE information existing japanese/lynx-current New
197545: [patch] japanese/lynx: add CPE information existing japanese/lynx New
197543: [patch] www/lynx: add CPE information existing www/lynx New
197542: Mk/Scripts/ Doesn't find libiconv library framework   New
197538: databases/tuning-primer: MariaDB 10.x errors with joins and InnoDB status existing databases/tuning-primer New
197537: graphics/p5-Image-ExifTool-devel update to 9.84 existing graphics/p5-Image-ExifTool-devel New
197533: [PATCH] lang/php-mode.el: update to 1.15.3 and etc existing lang/php-mode.el New
197532: [NEW PORT] x11-fm/gentoo3: Gtk3 version of x11-fm/gentoo new x11-fm/gentoo3 New
197531: textproc/bsdgrep: segfaults using grep --color -f existing textproc/bsdgrep New
197529: sysutils/xfce4-power-manager is incompatible with upower existing sysutils/xfce4-power-manager In Progress
197524: [patch] graphics/inkscape: add CPE information existing graphics/inkscape New
197522: Reset maintainership for ports owned by dhn@ unknown   New
197514: net/openldap24-server rc.d file file deletes required files in /tmp existing net/openldap24-server New
197510: [PATCH] Update audio/tomahawk to 0.8.2 existing audio/tomahawk In Progress
197509: net/ettercap 0.8.1 crashes unknown   Open
197505: emulators/linux-c6 option to use NVIDIAL_GL doesn't allow for use of legacy Nvidia drivers. existing emulators/linux-c6 Open
197495: net/nocatsplash FIXES USERS GUIDS MASTER_SITES, REMOVES BROKEN existing net/nocatsplash New
197494: [patch] security/tor-devel: add CPE information existing security/tor-devel New
197493: [patch] security/tor: add CPE information existing security/tor New
197492: www/uwsgi: port doesn't build any of uwsgi's plugins existing www/uwsgi New
197491: databases/mysql56-client: Configure fails if devel/readline is installed existing databases/mysql56-client New
197489: [patch] databases/postgresql94-server: add CPE information existing databases/postgresql94-server New
197488: [patch] databases/postgresql93-server: add CPE information existing databases/postgresql93-server New
197487: [patch] databases/postgresql92-server: add CPE information existing databases/postgresql92-server New
197486: [patch] databases/postgresql91-server: add CPE info existing databases/postgresql91-server New
197485: [patch] databases/postgresql90-server: add CPE information existing databases/postgresql90-server New
197482: www/mod_auth_kerb2: /usr/local/libexec/apache22/ Undefined symbol "gsskrb5_register_acceptor_identity" existing www/mod_auth_kerb2 New
197479: [Patch] devel/icu update to 54.1 existing devel/icu New
197477: net/opentracker: Does not allow to change bind/listen IP existing net/opentracker New
197472: editors/slime: Update to 2.12 existing editors/slime New
197453: science/clhep: Update to version existing science/clhep New
197447: net/py-netaddr: Update to version 0.7.12 existing net/py-netaddr In Progress
197444: math/gambit: Update to version 14.1.0 existing math/gambit In Progress
197435: games/tanglet: Update to version 1.3.1 existing games/tanglet New
197433: games/lgeneral: Update to version 1.2.5 existing games/lgeneral New
197432: games/gottet: Update to version 1.1.1 existing games/gottet New
197431: games/freedoko: Update to version 0.7.13 existing games/freedoko New
197430: games/cuyo: Update to version 2.1.0 existing games/cuyo New
197429: games/connectagram: Update to version 1.2.1 existing games/connectagram New
197428: games/awale: Update to version 1.6 existing games/awale New
197425: devel/synfig: Update to version 0.64.3 existing devel/synfig New
197424: devel/py-venusian: Update to version 1.0 existing devel/py-venusian New
197423: devel/ocaml-lacaml: Update to version 7.1.5 existing devel/ocaml-lacaml New
197422: devel/log4cpp: Update to version 1.1.1 existing devel/log4cpp New
197421: devel/libepp-nicbr: Update to version 1.15 existing devel/libepp-nicbr New
197420: devel/gpsim: Update to version 0.28.1 existing devel/gpsim New
197413: [PATCH] shells/fish: add CPE information existing shells/fish New
197410: net/py-pyzmq: Update to 14.5.0 existing net/py-pyzmq In Progress
197401: devel/lua-pty UNBREAK; FIXES MASTER_SITES existing devel/lua-pty New
197400: devel/lua-gettext UNBREAK - FIXES MASTER_SITES existing devel/lua-gettext New
197399: graphics/cairo won't build without X11 existing graphics/cairo New
197395: [exp-run] Update clang in base to 3.6.0 framework   In Progress
197393: security/libsecret doesn't build share/vala/vapi/libsecret-1.deps nor share/vala/vapi/libsecret-1.vapi existing security/libsecret New
197369: databases/virtuoso: poudriere fails building package existing databases/virtuoso New
197368: [new port] net/freediameter: Open source Diameter protocol implementation new net/freediameter New
197363: devel/pear: Can't install with active open_basedir existing devel/pear New
197361: [new port] net/dhcpd: OpenBSD dhcp daemon new net/dhcpd New
197357: print/cups-base (with PAM enabled) post-configure Makedefs patch may break PAMDIR. existing print/cups-base New
197355: multimedia/clipgrab upgrade existing multimedia/clipgrab New
197354: net-mgmt/p5-FusionInventory-Agent sees no pkg(8) packages existing net-mgmt/p5-FusionInventory-Agent New
197346: [PATCH] dns/unbound: enable libevent by default existing dns/unbound New
197341: [exp-run] ld: emit symbols for orphaned ELF sections whose names contain a period framework   Open
197340: audio/kid3-kde4 -- add upstream's patch existing audio/kid3-kde4 New
197333: [sysutils/bsdstats] Bsdstats malfunctions, and results aren't shown on the site existing sysutils/bsdstats New
197327: net/shaperprobe -ceased to function existing net/shaperprobe New
197320: net/samba41: "pkg install samba41" (or samba4) pre-compiled install missing idmap_ad / shared-module! existing net/samba41 New
197319: textproc/docbook: missing dependency on textproc/xmlcatmgr existing textproc/docbook New
197316: www/webkit-gtk2 : Fix build with DEFAULT_VERSIONS=python=3.3 existing www/webkit-gtk2 New
197307: upgrade to mail/thunderbird 31.4.0_1 broke enigmail? existing mail/thunderbird New
197305: security/tripwire: POST-INSTALL fails existing security/tripwire In Progress
197301: sysutils/fusefs-ntfs: Remove block device check in mkntfs existing sysutils/fusefs-ntfs New
197298: devel/deforaos-libsystem : update to 0.2.0 existing devel/deforaos-libsystem Open
197297: editors/vim BROKEN not buildable on RELENG_9 existing editors/vim New
197296: archivers/xarchiver does not handle xz compressed archives existing archivers/xarchiver New
197293: science/harminv: uses blaslapack and pathfix existing science/harminv New
197289: [new port] www/e2guardian: Dansguardian fork with bug fixes and improvements new www/e2guardian New
197279: mail/roundcube-automatic_addressbook new master site existing mail/roundcube-automatic_addressbook New
197269: net-mgmt/iftop 1.0pre4 unable to detect IPv6 traffic on pure monitoring interface existing net-mgmt/iftop New
197263: [NEW PORT] databases/spatialite-tools new databases/spatialite-tools New
197251: multimedia/xfce4-parole: doesn't build with NLS disabled existing multimedia/xfce4-parole In Progress
197249: net-mgmt/netams: doesn't build on 10.x+ existing net-mgmt/netams New
197239: p5 ports fail to build unknown   New
197236: net-im/farsight2 needs USES=python:2, not USES=python existing net-im/farsight2 New
197232: databases/mariadb100-server: fix build of TokuDB storage engine existing databases/mariadb100-server New
197229: [NEW PORT] japanese/narcissu2: Visual novel about an encounter of terminally ill new japanese/narcissu2 In Progress
197227: [PATCH] Fix mutexes in databases/db5 on ARMv6 and later existing databases/db5 In Progress
197226: lang/python27: fix pyport.h _PY_PORT_CTYPE_UTF8_ISSUE issue with c++ existing lang/python27 Open
197221: graphics/gle: Fails to link: Cannot find the library existing graphics/gle New
197219: Insufficient compiler information provided by Uses/ framework   New
197214: editors/vim: gvimrc system-wide runs set nocompatible and breaks a lot of settings existing editors/vim New
197209: sysutils/hfsexplorer: bump to 0.23 existing sysutils/hfsexplorer New
197197: [patch] graphics/atril: new options and fix for non-mate users existing graphics/atril New
197193: [PATCH] net-mgmt/nagios-plugins: add a -j (--jid) flag to check_procs which specifies jail id existing net-mgmt/nagios-plugins New
197192: [PATCH] net/socat Fix build with LibreSSL existing net/socat In Progress
197191: [patch] devel/dconf: hardcoded "/etc" causes ibus-dconf failure, leading to engine preferences not saved existing devel/dconf New
197189: lang/guile2 failure during build of finance/gnucash on FreeBSD 8.4 i386 existing lang/guile2 Open
197188: lang/erlang: configure fails when dtrace is enabled on 10.1R-amd64 existing lang/erlang New
197183: astro/xephem dumps core, failing to find classicfigs.csf and reports failure to find logo.gif existing astro/xephem New
197172: security/john: corrupted config file existing security/john New
197162: [NEW PORT] net-mgmt/dhcp_probe: Detect DHCP servers on network new net-mgmt/dhcp_probe Open
197133: multimedia/vid.stab Assumes -msse on all architectures existing multimedia/vid.stab New
197132: [mips] lang/luajit unsupported build with gcc < 4.3 existing lang/luajit In Progress
197131: net-mgmt/netdot fails to build due to rrdtool path in var/Makefile existing net-mgmt/netdot New
197129: games/scid: vulnerable files with mode 666 below /usr/local/share/scid/books existing games/scid New
197128: [mips] lang/php5 has no local asm code for mips existing lang/php5 Open
197127: [mips] lang/ocaml has no local asm code for mips existing lang/ocaml New
197126: [new port] audio/lv2 supersedes audio/lv2core new audio/lv2 New
197125: net-p2p/transmission-daemon 2.84_1 Segmentation Fault with signal 10 or 11 existing net-p2p/transmission-daemon New
197122: [NEW PORT] devel/py-waf: Meta build system new devel/py-waf Open
197116: New port: chinese/ibus-libpinyin new chinese/ibus-libpinyin New
197115: chinese/libpinyin: update to 1.0.0 existing chinese/libpinyin New
197103: science/vmd: Requires GCC, Respect CC/CXX existing science/vmd Open
197097: graphics/evince coredump on FreeBSD 11.0-CURRENT #0 r277714 existing graphics/evince New
197094: x11/nvidia-driver-304: 10-stable, SYSCTL_ADD_PROC, CTASSERT, CTLTYPE issues with cc existing x11/nvidia-driver-304 New
197093: games/angband does not need to specify CPPFLAGS and is in fact broken when it does so existing games/angband New
197092: [arm] x11-servers/xorg-vfbserver fails to build on armv6 existing x11-servers/xorg-vfbserver New
197087: print/texinfo: SHA256 Checksum mismatch for texinfo/5.2.20150101/texinfo.tex. existing print/texinfo In Progress
197083: [exp-run] devel/ruby-gems: update to 2.4.5 framework   Open
197080: databases/firebird25-client: Make config configuration is not saved existing databases/firebird25-client Open
197074: graphics/tesseract build fails existing graphics/tesseract New
197073: net/libsrtp should not require WITH_OPENSSL_PORT existing net/libsrtp Open
197072: devel/ipython: Support for Python3.x is missing existing devel/ipython New
197071: editors/libreoffice doesn't build offline help existing editors/libreoffice New
197063: games/minecraft-client: runtime is still broken... existing games/minecraft-client In Progress
197054: net/shadowsocks-libev: update to 1.6.4 existing net/shadowsocks-libev In Progress
197050: [UPDATE] devel/goffice010 to 0.10.19 existing devel/goffice010 New
197049: security/py-cryptography fix build failure with LibreSSL-2.1.3 existing security/py-cryptography Open
197048: converters/fribidi: Update to 0.19.6 existing converters/fribidi New
197044: sysutils/zxfer: out of date with upstream existing sysutils/zxfer New
197035: sysutils/bbcp: segmentation fault and core dump when running latest version (20150113) existing sysutils/bbcp New
197032: [PATCH] x11-servers/xorg-server One pixel border glitch existing x11-servers/xorg-server New
197027: port mail/dovecot - patch to disable SSLv2 and SSLv3 (POODLE) existing mail/dovecot New
197025: net/tsocks: handle EISCONN existing net/tsocks New
197019: [NEW PORT] science/rubygem-gphys new science/rubygem-gphys In Progress
197018: [NEW PORT] science/rubygem-ruby-dcl: Ruby interface to the scientific graphic library DCL new science/rubygem-ruby-dcl In Progress
197011: textproc/p5-XML-SAX: checksum mismatch for ParserDetails.ini existing textproc/p5-XML-SAX In Progress
197010: games/whichwayisup - running dependencies existing games/whichwayisup New
197008: databases/p5-DBD-mysql SSL option broken and USE_OPENSSL existing databases/p5-DBD-mysql In Progress
197007: [patch] sysutils/bacula-server suggestions for device permission handling existing sysutils/bacula-server New
197005: [PATCH] security/libressl update to 2.1.3 incl vulnerability fix existing security/libressl New
197004: net/openldap24-server: Unable to generate SSHA256/384/512 hashes using SHA2 overlay existing net/openldap24-server New
196995: [NEW PORT] math/rubygem-ruby-lapack: a Ruby wrapper of Lapack new math/rubygem-ruby-lapack New
196988: devel/poco-devel not respecting CC nor CPP existing devel/poco-devel New
196985: [arm] audio/bristol attempts to use SSE instructions on all architectures existing audio/bristol In Progress
196978: [x11-drivers/xf86-input-evdev] [comms/libevdev] [new ports] to allow better support for wacom tablets unknown   New
196976: Biber (BibTeX replacement) missing from TeXLive (print/texlive-full) existing print/texlive-full New
196959: audio/libmusicbrainz5: Use of undefined std:string behaviour causes sound-juicer crash existing audio/libmusicbrainz5 Open
196947: [NEW PORT] devel/py-python-pcre: Python PCRE Library new devel/py-python-pcre In Progress
196940: fix and cleanup plists framework   New
196935: lang/python27: Fails during install on PPC 10.1-RELEASE existing lang/python27 Open
196927: [PATCH] security/pam_mysql: Add OpenSSL for non crypt()ish MD5 support existing security/pam-mysql New
196926: [NEW PORT] x11-themes/gnome-icons-flattr: Icon theme for GTK inspired by flat design new x11-themes/gnome-icons-flattr Open
196914: science/dlpoly-classic fails to build with GCC 4.9 existing science/dlpoly-classic New
196903: sysutils/garcon , x11-wm/xfce4-panel with unset option NLS results in GNU gettext tools not found existing sysutils/garcon In Progress
196899: [arm] lang/ghc porting project, marked as i386/amd64 only existing lang/ghc In Progress
196898: [arm] security/gpgme build hangs indefinitely while running tests existing security/gpgme New
196895: databases/mariadb100-server raw device not working as InnoDB data file existing databases/mariadb100-server New
196892: devel/arduino - java Abort trap while upload sketch existing devel/arduino New
196887: x11-fonts/fontconfig: enable static library existing x11-fonts/fontconfig New
196874: [NEW PORT] www/trac-exceldownload: download report and ticket pages as Excel file for Trac wiki new www/trac-exceldownload New
196871: Mk/Uses/ modernize gac macros framework   New
196862: math/py-matplotlib: Fail - gcc48/ not found existing math/py-matplotlib New
196857: lang/nhc98 fails to build with GCC 4.9 (core dump) existing lang/nhc98 In Progress
196853: graphics/exrtools fails to build when default GCC is 4.9 -- due to OpenEXR using GCC 4.9 existing graphics/exrtools Open
196852: devel/libcwd fails to build with GCC 4.9, USE_GCC=any is a lie existing devel/libcwd New
196851: biology/seqan fails to build with GCC 4.9 (requires GCC 4.8) existing biology/seqan New
196850: audio/musicpd fails to build with GCC 4.9 (even though it claims USE_GCC=yes) existing audio/musicpd New
196849: audio/beast fails to build with GCC 4.9 (requires GCC 4.8) existing audio/beast New
196835: [New port] devel/rubygem-netaddr (A ruby library for manipulating network addresses.) new devel/rubygem-netaddr New
196830: x11/libxcb expects x11/xcb-proto >= 1.11, yet x11/libxcb/Makefile tests only for x11/xcb-proto >= 1.9 existing x11/libxcb New
196829: [PATCH]: Update security/tor-devel to existing security/tor-devel New
196825: [NEW] devel/lua-lpeg: Parsing Expression Grammars module for LUA new devel/lua-lpeg In Progress
196821: [UPDATE] devel/libev to 1.49 existing devel/libev New
196815: net/cloud-init: incorrectly depends on sysutils/gpart existing net/cloud-init New
196810: New port: www/kanboard Kanboard is a simple visual task board software. new www/kanboard New
196806: print/cups-base: build fails if any option other than MDNSRESPONDER is selected existing print/cups-base New
196805: editors/codelite make install crash with ihunspell problem existing editors/codelite New
196796: [NEW PORT] sysutils/librolegen: Library to generate WebOS system bus role files new sysutils/librolegen Open
196795: New port: devel/pmloglib-headers Headers for WebOS logging library, pmloglib new devel/pmloglib-headers New
196794: New port: devel/libsandbox WebOS library to separate running applications new devel/libsandbox New
196784: [PATCH]: Update x11/lsw to 0.3 existing x11/lsw New
196773: math/p5-Math-BigInt: overloading .. fails existing math/p5-Math-BigInt New
196770: www/chromium does not run if built with DEBUG option existing www/chromium New
196767: New port: databases/libpqtypes - Extension to libpq parameter handling new databases/libpqtypes New
196756: mail/spamilter: Add IPv6 AAAA Lookups for MtaHostChk existing mail/spamilter In Progress
196754: www/chromium 39.0.2171.95_3 segfaults during login with security key existing www/chromium New
196753: audio/musicpd adplug undefined reference existing audio/musicpd New
196750: x11-themes/fluxbox-tenr-styles-pack: Update to 20100605 existing x11-themes/fluxbox-tenr-styles-pack Open
196745: devel/qgit fix with newer git existing devel/qgit New
196735: [emulators/snes9x-gtk] Won't build. PortAudio error. existing emulators/snes9x-gtk New
196734: devel/libvirt: gnutls support existing devel/libvirt Open
196729: multimedia/gstreamer: Fix too late occurrence of USES= existing multimedia/gstreamer New
196723: [UPDATE] sysutils/duply update to 1.9.1 existing sysutils/duply New
196712: exp-run: Update lang/gcc from GCC 4.8 to GCC 4.9 framework   In Progress
196708: [patch] emulators/pipelight: fix build in poudriere existing emulators/pipelight New
196707: [patch] graphics/shotwell: fix build after webkit-gtk3 update to 2.4.8 existing graphics/shotwell New
196705: [patch] x11-fm/sushi Fix build after webkit-gkt3 update to 2.4.8 existing x11-fm/sushi New
196704: [patch] finance/gnucash: extra patch to get it build after webkit-gtk2 was updated 2.4.7 existing finance/gnucash New
196702: chinese/ttfm: fix to allow chinese/arphicttf to build in poudriere existing chinese/ttfm Open
196700: [PATCH] mail/mime-construct: remove converters/p5-MIME-Base64 from RUN_DEPENDS. existing mail/mime-construct New
196696: [PATCH] Mk/, fix support of Python for GStreamer 1.0 API framework   New
196682: New port: x11/bar-aint-recursive - Lightweight xcb based bar new x11/bar-aint-recursive New
196680: mail/razor-agents: Unable to install, missing files existing mail/razor-agents Open
196678: [x11-servers/xorg-server] [PATCH] Xorg devd backend existing x11-servers/xorg-server New
196673: emulators/dosbox amd64 hangs when exeuting a dos program e.g. "settlers 2" existing emulators/dosbox Open
196671: net/wireshark: fail to build when security/krb5 is installed existing net/wireshark New
196669: x11/sterm not recognised by termcap on 10.1 existing x11/sterm New
196668: sysutils/logrotate: segmentation fault due to differences in qsort_r implementations existing sysutils/logrotate New
196667: www/firefox crashes often when loading multiple multimedia/gstreamer1 content once again (e.g. HTML 5 YouTube) existing www/firefox New
196661: shells/fish: fish shell is not accepting any commands existing shells/fish Open
196659: x11-fonts/croscorefonts-fonts-ttf: Update license information existing x11-fonts/croscorefonts-fonts-ttf New
196657: [NEW PORT] games/openbor: Moddable fighting game engine (aka Beats of Rage) new games/openbor New
196653: x11-servers/xorg-vfbserver: This package requires x11/xkeyboard-config existing x11-servers/xorg-vfbserver New
196649: New Port: games/stendhal - 2d MMORPG client and server new games/stendhal In Progress
196642: [PATCH] lang/pcc: Update to v1.1.0 existing lang/pcc Open
196637: New Port: editors/wxhexeditor - hex editor that can handle large files new editors/wxhexeditor New
196623: lang/go: Won't build on armv6 because of limitation in Makefile existing lang/go New
196617: textproc/dblatex can not be invoked existing textproc/dblatex New
196612: [NEW PORT] net/gen_utp: Erlang API and driver for uTP new net/gen_utp New
196605: x11/lsw: Update to 0.3 existing x11/lsw New
196600: net/freeradius3 infinite loop kqueue bug in 3.0.6 existing net/freeradius3 New
196590: Feature request: add patch-list target framework   New
196588: [databases/libmemcached] -fPIE is not supported on older FreeBSD versions existing databases/libmemcached New
196584: ports-mgmt/portmaster not working for multiple ports in category/portname/ format existing ports-mgmt/portmaster New
196581: security/silktools 3.9.0 timestamp issue existing security/silktools New
196577: [maintainer] Update cad/elmerfem also use blaslapack existing cad/elmerfem New
196576: [patch] graphics/svgalib build broken with WITH_DEBUG=YES existing graphics/svgalib New
196548: devel/trac-bitten: [patch] fix for newer Trac versions existing devel/trac-bitten New
196547: [Patch] net/isc-dhcp43-server chrootdir modification to make use of rc.d/syslogd's syslogd_altlog_proglist existing net/isc-dhcp43-server New
196539: [MAINTAINER] x11-drivers/xf86-input-wacom: update to 0.28.0 existing x11-drivers/xf86-input-wacom Open
196537: New Port: sysutils/ktsuss - Desktop independent front-end for su/sudo new sysutils/ktsuss New
196536: Update devel/libc++ port to r224926 existing devel/libc++ Open
196534: mail/spampd: update to spampd-2.42(patched files) existing mail/spampd New
196523: [devel/xdg-user-dirs] PATCH: Change directory "/etc/xdg" to "/usr/local/etc/xdg" in manpages existing devel/xdg-user-dirs New
196521: math/spooles: fix docs option existing math/spooles New
196520: [Patch] dns/bind910 rc.d/named auto-chroot reenable existing dns/bind910 New
196519: BUILD_DEPENDS can not contain templates framework   Open
196516: [New Port] mail/openemm2013 OpenEMM a email marketing enterprise app new mail/openemm2013 Open
196508: lang/phantomjs: phantomjs requires gcc48 but needs gcc49 with GLIBCXX_3.4.11 existing lang/phantomjs New
196503: [patch] update www/xpi-colorfultabs from 19.0 to 25.7 existing www/xpi-colorfultabs New
196491: comms/gnuradio on 10.1-release not working existing comms/gnuradio New
196481: devel/gconf2: Shared object "" not found existing devel/gconf2 In Progress
196480: www/nginx-devel: This port should be named nginx-mainline not -devel existing www/nginx-devel New
196475: [New Port] net-p2p/libtorrent-rasterbar1 - C++ library implementing a BitTorrent client new net-p2p/libtorrent-rasterbar1 New
196470: net/freeradius2 version 2.2.6_2 FreeBSD10p3 amd64 high CPU usage existing net/freeradius2 New
196467: audio/ncmpcpp: script "configure" failed unexpectedly existing audio/ncmpcpp New
196464: emulators/open-vm-tools-nox11: comparison of constant 'WIPER_ENABLED' (2) with boolean expression is always false existing emulators/open-vm-tools-nox11 New
196462: [CHANGE-REQUEST] XFT support for x11/xdm existing x11/xdm New
196457: textproc/py-bugzillatools: fix USES=python and add license existing textproc/py-bugzillatools New
196453: [NEW PORT] audio/festvox-cmu_us_*_arctic: CMU ARCTIC voices for festival new audio/festvox-cmu_us_ New
196452: games/kanatest: Wont run: "Segmentation fault" existing games/kanatest New
196451: devel/valgrind: Added VKI_F_DUPFD_CLOEXEC for FreeBSD fcntl existing devel/valgrind Open
196450: devel/clig: Take MAINTAINER'ship, Update MASTER_SITES, WWW existing devel/clig Open
196435: Prevent @sample keyword from removing user symlinks framework   New
196434: [New port]: net/p5-Amazon-S3 - a really working Perl interface to Amazon S3 new net/p5-Amazon-S3 New
196433: www/grails: Update to version 2.4.4 existing www/grails New
196429: lang/python27: 2.7.9 fails to build existing lang/python27 New
196428: [NEW PORT] textproc/p5-Lingua-Identify-CLD - Interface to Chrome language detection library new textproc/p5-Lingua-Identify-CLD New
196414: x11-toolkits/linux-c6-tk85 doesn't build as unprivileged user. existing x11-toolkits/linux-c6-tk85 New
196410: dns/idnkit: Fails to compile with integrated libiconv existing dns/idnkit New
196409: [PATCH] graphics/djview4: Improvements for 4.9 version existing graphics/djview4 New
196399: databases/mariadb100-server: MariaDB daemon segfaults when built with clang 3.4 on 10.1-i386 existing databases/mariadb100-server New
196396: [UPDATE] net/liferea to 1.10.12 existing net/liferea New
196395: [UPDATE] devel/orc to 0.4.23 existing devel/orc New
196394: [UPDATE] sysutils/upower to 0.99.2 existing sysutils/upower In Progress
196382: security/gnupg breaks keyring on 2.1.1 existing security/gnupg New
196357: lang/python27: SSL certificate verification error, Python not finding SSL pem file existing lang/python27 In Progress
196348: sysutils/bacula-server: mssing dependency to libiconv existing sysutils/bacula-server New
196340: Mk/Uses/ PYTHON_VERSION variable in DEPENDS_ARGS conflicts with and breaks autoconf-based ports framework   Open
196336: security/py-fail2ban: Support Python 3 existing security/py-fail2ban Open
196333: www/webkit-gtk2: allow to build with GNU binutils installed existing www/webkit-gtk2 In Progress
196329: comms/xnecview: Remove RUN_DEPENDS on nec2c existing comms/xnecview New
196327: ports-mgmt/pkg: pkg.conf(5): -y is documented yet does not work existing ports-mgmt/pkg New
196326: rubygem framework bug : building occurs in stage phase framework   New
196325: [PATCH] net-mgmt/nrpe: Option whether to depend on monitoring-/nagios-plugins existing net-mgmt/nrpe New
196321: print/gutenprint-base: Enable building without GTK2 existing print/gutenprint-base New
196317: [new port] x11-themes/gnome-icons-humility - Shiny Clean Vector Theme for Gnome, and Xfce4 new x11-themes/gnome-icons-humility New
196316: multimedia/pwcview: package 1.4.1-6 will not start needs install pwcview from port works fine existing multimedia/pwcview New
196315: [new port] x11-themes/gnome-icons-alternative, GNOME Icon Theme with alternative folders new x11-themes/gnome-icons-alternative New
196313: [new port] x11-themes/gnome-icons-blank-on, Icon theme for Gnome, Xfce4 desktop new x11-themes/gnome-icons-blank-on New
196312: [new port] x11-themes/gnome-icons-gorilla Gorilla SVG Icons for Gnome new x11-themes/gnome-icons-gorilla New
196310: [NEW PORT] x11-themes/cursor-ardoise-theme: Ardoise X cursor theme new x11-themes/cursor-ardoise-theme New
196307: [NEW PORT] sysutils/py-tmuxp: Session manager for tmux new sysutils/py-tmuxp Open
196306: [NEW PORT] devel/py-kaptan: Config file parser for json, yaml and ini files new devel/py-kaptan New
196297: Mark graphics/epeg depracated existing graphics/epeg New
196295: devel/dbus: I/O error on installation existing devel/dbus New
196292: math/R: Configure error: Support for MBCS locales is required existing math/R New
196271: www/xpi-locale-switcher: Locale Switcher is incompatible with FF 34.0.5 existing www/xpi-locale-switcher New
196270: www/xpi-bookmarkdd: Bookmark Duplicate Detector is incompatible with FF 34.0.5 existing www/xpi-bookmarkdd New
196269: sysutils/py-ranger: wrong characters in non-ascii filenames existing sysutils/py-ranger New
196267: sysutils/confman please check if this port also supports subversion 1.8 existing sysutils/confman New
196266: security/bro: broken pkg-plist existing security/bro New
196258: New port: math/cmlib NIST core Fortran math library new math/cmlib New
196249: net/ortp: Build with encryption support existing net/ortp New
196247: devel/libzrtpcpp builds fine with base openssl existing devel/libzrtpcpp New
196244: ports-mgmt/poudriere: add EXAMPLES option (ports-mgmt/poudriere-devel as well) existing ports-mgmt/poudriere New
196238: www/npm fails to install existing www/npm New
196237: sysutils/php5-fileinfo fails to build (clang bug?) existing sysutils/php5-fileinfo Open
196236: graphics/shotwell: Segmentation fault existing graphics/shotwell New
196229: lang/python27: Build (ctypes) fails on i386 with LIBFFI option off existing lang/python27 Open
196224: [NEW PORT] textproc/smi (Simple Markup interpreter / filter for simple markup) new textproc/smi New
196188: graphics/ImageMagick: On i386 bogus -march=penryn is appended behind -march=core2 existing graphics/ImageMagick In Progress
196185: emulators/hyperv-is: Update Hyper-V ports for FreeBSD 10.1 existing emulators/hyperv-is New
196182: [PATCH] upgrade graphics/lensfun to 0.3.0 existing graphics/lensfun In Progress
196176: [PATCH] devel/libgit2: Update to 0.21.5 existing devel/libgit2 New
196171: pkg install x11/xorg:10:i386/latest/All/xorg-server-1.12.4_9,1.txz: Not Found existing x11/xorg In Progress
196165: [NEW PORT] java/wildfly90 new java/wildfly90 New
196161: graphics/devil: patch to remove GCC-requirement existing graphics/devil New
196155: graphics/freeglut: fix build on mips, remove .la file, strip library existing graphics/freeglut New
196145: lang/erlang: Enable Emacs Erlang mode as optional feature existing lang/erlang In Progress
196133: emulators/virtualbox-ose 4.3.20_2, partially works with LAGG(4) as Bridged Adapter. existing emulators/virtualbox-ose New
196117: www/c-icap crashing after last update existing www/c-icap New
196109: Allow LIB_DEPENDS depend on ports with USE_LDCONFIG != yes framework   New
196099: graphics/sdl_image and graphics/sdl2_image: direct linking instead of dlopen(3) existing graphics/sdl_image New
196092: [UPDATE] graphics/mesa-demos to v8.2.0 existing graphics/mesa-demos New
196078: [patch] unbreak x11-fm/sushi build on FreeBSD 8 existing x11-fm/sushi New
196074: [patch] sysutils/consolekit: log file in plist existing sysutils/consolekit New
196068: ports-mgmt/pkg: incorrect output for pkg query '%n %B' existing ports-mgmt/pkg In Progress
196065: [PATCH] security/nmap Compilation test omits native-xtools environment (poudriere + native-xtools) existing security/nmap Open
196059: www/nginx: nginx worker crashes with HTTPS request using TLS => 1.0 existing www/nginx New
196056: Wrong python interpreter set in Mk/Uses/ framework   Open
196053: databases/postgresql93-server fails to build when DTrace enabled existing databases/postgresql93-server New
196049: [NEW PORT] net/py-pysocks: Python SOCKS module new net/py-pysocks Open
196045: print/texlive-base PORTREVISION 4 needs UPDATING entry, can no longer install from ports with older version installed existing print/texlive-base In Progress
196041: [patch] unbreak x11/gnome-shell stage-qa on FreeBSD 8 existing x11/gnome-shell New
196036: audio/tuxguitar: doesn't start existing audio/tuxguitar Open
196026: mail/roundcube: Port does not install .htaccess files [security problem] existing mail/roundcube Open
196022: www/mediawiki124: SQL error on remote PostgreSQL 9.3 server existing www/mediawiki124 New
196021: graphics/opencv: pkg-config file is broken existing graphics/opencv New
196018: graphics/exif 0.6.21 has several problems with handling photos existing graphics/exif New
196016: www/bacula-web please correct pkg-plist existing www/bacula-web In Progress
196012: patches fixing two math/xgraph bugs: XWindow re-size and command line Geometry option existing math/xgraph Open
196004: [PATCH] remove unused entries from _WEBPLUGIN_APPS_ALL framework   Open
196000: graphics/xsane: Not recognized by gimp when installed as a package existing graphics/xsane Open
195999: x11-wm/enlightenment: startx hangs after system upgrade to 10.1 existing x11-wm/enlightenment Open
195993: graphics/inkscape linking fails when ImageMagick has compiled w/ openmp existing graphics/inkscape New
195992: sysutils/rsyslog8: Relp support would be a nice default option existing sysutils/rsyslog8 New
195986: [MAINTAINER] www/trafficserver: Update to 5.1.1 existing www/trafficserver New
195985: [MAINTAINER] java/eclipse: Update to 4.4.1 existing java/eclipse New
195982: security/openvpn-devel: Update to latest snapshot 201450 existing security/openvpn-devel In Progress
195981: GNOME Shell Extensions do not install/update via Extensions website existing x11/gnome3 New
195975: [NEW PORT] games/unteralterbach: Visual novel satire on pedohysteric society new games/unteralterbach New
195966: [patch] editors/vim: Fix gvim tag command with EXUBERANT_CTAGS existing editors/vim New
195957: devel/binutils fails to compile when gold is enabled existing devel/binutils New
195955: New ports: net-p2p/novacoin and net-p2p/novacoin-daemon: Energy efficient and decentralized cryptocurrency new net-p2p/novacoin New
195951: sysutils/password-store: Adding contrib to default configuration options existing sysutils/password-store New
195949: sysutils/udfclient build fails with FUSE option enabled existing sysutils/udfclient New
195943: [patch] unbreak graphics/evince build on FreeBSD 8 existing graphics/evince New
195939: emulators/pipelight youtube (h.264) flash crush existing emulators/pipelight New
195933: editors/vim-lite (possibly vim) fails during helptag generation existing editors/vim-lite New
195932: audio/taglib - Does't seems to make a debug build existing audio/taglib New
195920: [PATCH] Add capsicum support to net/tcpdump existing net/tcpdump New
195919: net-mgmt/observium version bump ( existing net-mgmt/observium New
195916: www/nginx: compiled-in error log location is littering /var/log existing www/nginx New
195909: emulators/pipelight Pipelight Error (flash)! existing emulators/pipelight New
195907: [patch] x11-toolkits/ocaml-lablgtk2: Fix build without DOCS existing x11-toolkits/ocaml-lablgtk2 New
195899: Bug in PAM handling in x11/kde4-workspace existing x11/kde4-workspace New
195898: www/tomcat7 rc.d script does not honor forcestop and no longer kills tomcat (as in version 6) existing www/tomcat7 New
195896: [revive port] devel/py-gitpython: Resurrect previously deleted port new devel/py-gitpython Open
195894: www/firefox: plist doesn't list empty directory existing www/firefox New
195889: check-plist does not respect @comment framework   Open
195888: audio/musicpd build fails on ApeReplayGain.cxx [amd64] existing audio/musicpd Open
195887: editors/lazarus failed to build existing editors/lazarus New
195886: [maintainer] databases/php5-pdo_cassandra: update to 0.2.1_5 existing databases/php5-pdo_cassandra Open
195873: [NEW PORT] www/django-netfields, makes proper PostgreSQL net related fields for Django. new www/django-netfields New
195866: devel/avrdude: hidden dependency on libftdi existing devel/avrdude New
195863: devel/tcllib does not compile existing devel/tcllib Open
195861: [patch] textproc/elasticsearch set Min JVM heap size = Max JVM heap size existing textproc/elasticsearch New
195852: mail/opensmtpd stops logging if syslogd is restarted existing mail/opensmtpd New
195844: Can't build emulators/virtualbox-ose existing emulators/virtualbox-ose New
195842: audio/musescore: Doesn't launch with JACK Option existing audio/musescore New
195841: [patch] print/cups-pstoraster appears to need MAKE_JOBS_UNSAFE=yes existing print/cups-pstoraster New
195838: sysutils/ezjail generatest wrong /var/run/jail..conf existing sysutils/ezjail Open
195835: sysutils/grub2 10_kfreebsd fails to identify kernel and zpool.cache proper location existing sysutils/grub2 Open
195833: lang/mono crashes: Assertion at gc-memfuncs.c:79, condition `unaligned_bytes (dest) == 0' not met existing lang/mono New
195828: security/tor and security/tor-devel pkg-message for enabling random IP IDs existing security/tor New
195816: [www/chromium] fix of handling of spaces in shell script existing www/chromium New
195815: [NEW PORT] games/aquaria: Underwater 2D fantasy action-adventure new games/aquaria New
195807: [MAINTAINER] Update sysutils/zsd to 2014-12-07-c2d3662 existing sysutils/zsd Open
195800: [NEW PORT] games/narcissu2: Visual novel about an encounter of terminally ill new games/narcissu2 New
195796: exp-build with WITH_OPENSSL_PORT=yes and SSLv2/SSLv3 disabled framework   In Progress
195790: www/mod_perl2: Leave httpd.conf unmolested when installing / uninstalling / upgrading mod_perl2 existing www/mod_perl2 New
195787: security/py-pysha3 core dumped, when building without threads existing security/py-pysha3 In Progress
195783: [Update] Update math/R to 3.1.2 existing math/R New
195777: New port: devel/ocaml-ppx-tools Tools for for authors of PPX rewriters new devel/ocaml-ppx-tools New
195774: graphics/Coin3d x11-toolkits/soqt x11-toolkits/SoXt: Fix incorrect LICENSE information existing graphics/Coin Open
195773: New port: devel/camlp4 OCaml camlp4 processeor new devel/camlp4 New
195753: [patch] deskutils/vboxgtk - cannot create a VM via vboxgtk existing deskutils/vboxgtk Open
195739: x11/cinnamon isn't installing existing x11/cinnamon In Progress
195737: New port: x11-toolkits/ocaml-labltk OCaml support for TK new x11-toolkits/ocaml-labltk In Progress
195736: lang/ocaml: update to 4.02.1 existing lang/ocaml New
195716: [new port] java/GCViewer: classic little tool for java garbage collector log analysis new java/GCViewer New
195715: net/torsocks needs upgrade to 2.0 existing net/torsocks New
195708: www/aria2 - build failure: libtool: link: `DownloadEngine.lo' is not a valid libtool object existing www/aria2 New
195699: making «make update» works for both git only setup and git+svn setup framework   New
195698: dns/dnscrypt-proxy support for multiple service instances existing dns/dnscrypt-proxy Open
195678: mail/thunderbird does not build against security/gnupg20 existing mail/thunderbird New
195677: [PATCH] devel/xdg-utils: xdg-open broken for non-KDE/non-GNOME users existing devel/xdg-utils New
195662: [request] Postfix binary package with SASL (and TLS) support unknown   New
195659: net/samba36 fails to build with security/heimdal existing net/samba36 In Progress
195656: [www/nginx] extra_drizzle Is out of date and broken existing www/nginx New
195606: Serial ports under emulators/virtualbox-ose do not works existing emulators/virtualbox-ose New
195601: [patch] archivers/file-roller 3.14.1 fails to build on FreeBSD 8.4 existing archivers/file-roller New
195599: [NEW PORT] ftp/fastdfs + ftp/php5-fastdfs new ftp/fastdfs New
195597: [patch] deskutils/gnote 3.14.0 build fails on FreeBSD 8.4 existing deskutils/gnote New
195589: /emulators/linux_base-c6 installation failed during port upgrade existing emulators/linux_base-c6 Open
195582: deskutils/mirall: Update to version 1.7.0 existing deskutils/mirall In Progress
195571: [patch] emulators/open-vm-tools fix empty dir warnings existing emulators/open-vm-tools New
195562: sysutils/php56-fileinfo 5.6.3 crashes apache existing sysutils/php56-fileinfo New
195556: www/squid33 extend expiration date existing www/squid33 Open
195538: sysutils/polkit fails while building man target and reports recursion in catalog and being unable to load an external entity existing sysutils/polkit New
195536: lang/ruby20 fails to build on powerpc64 existing lang/ruby20 New
195530: ports-mgmt/pkg: pkg catalog not updating existing ports-mgmt/pkg New
195521: etc/rc.d/mroute6d should be a part of net/mcast-tools, not a part of the base system existing net/mcast-tools New
195515: lang/python: Unstable and fails its own test suite existing lang/python Open
195513: lang/python32: Fix build with LibreSSL existing lang/python32 New
195511: lang/python33: Fix build with LibreSSL existing lang/python33 New
195500: www/webkit-gtk3 : allow building with GNU binutils installed existing www/webkit-gtk3 New
195496: New port: devel/p5-Array-Heap a fast heap implementation for perl new devel/p5-Array-Heap In Progress
195493: databases/postgresql93-server port install with dtrace enabled fails existing databases/postgresql93-server New
195492: net-im/telepathy-glib build goes into endless loop existing net-im/telepathy-glib New
195490: devel/mingw32-gcc build affected by similar-named files in /usr/local/include existing devel/mingw32-gcc New
195481: [PORT] x11-wm/enlightenment: error on startup related to cpufreq (v0.19.1) existing x11-wm/enlightenment New
195478: [New Port] textproc/linuxdoc-tools sgml-tools fork for handling linuxdoc DTD SGMLs new textproc/linuxdoc-tools New
195467: ports-mgmt/pkg built from ports reports it needs to be reinstalled existing ports-mgmt/pkg In Progress
195456: editors/libreoffice fails to configure existing editors/libreoffice New
195452: editors/abiword: probably incorrect option group handling existing editors/abiword New
195424: [Update] net/hanstunnel fix build with GCC existing net/hanstunnel In Progress
195413: I have updated devel/ruby-gems to 2.4.4 existing devel/ruby-gems New
195412: print/foomatic-db-engine: Fix staging with DEVELOPER=yes set in /etc/make.conf existing print/foomatic-db-engine New
195403: lang/erlang: Enable HIPE, JAVA and WX by default existing lang/erlang In Progress
195396: print/tex-luatex fails to build existing print/tex-luatex In Progress
195394: x11/gnome-terminal fails to start existing x11/gnome-terminal New
195368: some of deskutils/gnome-shell-ext* are unusable existing deskutils/gnome-shell-extra-extensions New
195365: can't build emulators/virtualbox-ose existing emulators/virtualbox-ose New
195362: Strange behavior of www/squid during his restart on 10.1 release existing www/squid New
195359: [PATCH] sysutils/vpnc-scripts enable use of resolvconf existing sysutils/vpnc-scripts New
195350: Update devel/cc65 to new upstream and infrastructure existing devel/cc65 New
195339: Bulding sysutils/testdisk with option PROGSREISERFS on existing sysutils/testdisk New
195336: [new port] java/wildfly82 new java/wildfly82 New
195333: Inconsistent handling of ALL_TARGET, INSTALL_TARGET by options framework framework   Open
195332: New port: devel/mongo-cxx-driver Official Mongo C++ Driver with stagging support new devel/mongo-cxx-driver New
195325: x11/gdm 3.14.1 Failed to give slave programs access to the display existing x11/gdm In Progress
195313: [maintainer] net/hanstunnel existing net/hanstunnel New
195309: misc/mc 4.8.13 does not display man files existing misc/mc Open
195308: security/krb5 ldap option - no kerberos.schema file on install existing security/krb5 New
195306: sysutils/polkit: Build failure. Missing dependency on misc/gnomehier existing sysutils/polkit New
195305: textproc/docbook-xml stage problem existing textproc/docbook-xml New
195304: ports-mgmt/portmaster fails to auto delete deleted ports existing ports-mgmt/portmaster New
195296: [exp-run] Enable VIMAGE in kernel config, and do a ports exp run framework   Open
195288: www/chromium gcc fails existing www/chromium New
195285: shells/zsh: completion for cvs does not work any more existing shells/zsh New
195283: math/taucs fails to build on amd64 with atlas existing math/taucs New
195282: multimedia/clutter-gst 'clutter_gst_init' is invalid in C99 existing multimedia/clutter-gst New
195268: [patch] archivers/ruby-lha: fix build for ruby 2.0 existing archivers/ruby-lha New
195265: textproc/xlhtml: Compile error (autotools related) existing textproc/xlhtml Open
195252: devel/subversion: add Reported by field existing devel/subversion New
195244: archivers/paq: Update zpaq to 6.55 existing archivers/paq New
195226: security/gnupg: conflicts with security/gnupg1 existing security/gnupg Open
195217: databases/mysql55-client: error: use of undeclared identifier 'base64_needed_encoded_length' existing databases/mysql55-client In Progress
195203: [stage-qa] New check 'proxydeps': check for missing package dependencies framework   New
195198: print/tex-formats does not install anything: empty ${STAGEDIR} existing print/tex-formats New
195187: Build of graphics/cairo fails at package stage (under poudriere) existing graphics/cairo In Progress
195186: net-mgmt/icinga2: CMake Error when MySQL deselected existing net-mgmt/icinga2 New
195178: distfile update for net/openafs existing net/openafs Open
195154: x11/nvidia-driver: REDZONE: Buffer overflow detected. 16 bytes corrupted.... existing x11/nvidia-driver In Progress
195152: The ports infrastructure will build dependencies against the default version of Python rather than what the desired port requires framework   Open
195147: [patch] comms/gammu: Add mysql support existing comms/gammu New
195145: net/iet kernel panic on FreeBSD 10.1 release (x64) existing net/iet New
195129: sysutils/rsyslog8 [patch] Missing ntp facility existing sysutils/rsyslog8 In Progress
195123: devel/arduino: missing dependencies? existing devel/arduino Open
195105: devel/qt5 cannot find GL/gl.h with Clang existing devel/qt5 New
195100: [patch] games/zoom: use DOCS option to install HTML manual and set LICENSE existing games/zoom New
195099: databases/cassandra2: JVM crashes on 2.1.1 existing databases/cassandra2 Open
195097: x11/nvidia-driver: Kernel panic after "NVRM: rm_init_adapter() failed!" existing x11/nvidia-driver In Progress
195096: Corrupted colours in with x11/nvidia-driver 340.46 existing x11/nvidia-driver In Progress
195080: x11/nvidia-driver / graphics/libGL affected by install order existing x11/nvidia-driver In Progress
195077: [patch] net-mgmt/icinga: fix cflags existing net-mgmt/icinga New
195068: update games/scid to 4.5.2 existing games/scid New
195066: [audio/pulseaudio] Added missing USES=iconv clause existing audio/pulseaudio New
195044: devel/dbus staging fails when generating doc existing devel/dbus New
195038: new port: www/py-django-jsonfield new www/py-django-jsonfield New
195037: new port: www/py-django-bootstrap-form new www/py-django-bootstrap-form New
195015: [patch] net-mgmt/pnp: update to 0.6.24 existing net-mgmt/pnp New
195004: [PATCH] security/openvpn: Fix openvpn with aesni.ko loaded existing security/openvpn Open
194999: devel/git: Support for svn propset in git-svn existing devel/git New
194986: [New port] databases/levygo new databases/levygo Open
194984: textproc/heirloom-doctools - otfdump conflicts existing textproc/heirloom-doctools In Progress
194981: ports-mgmt/pkg pkg-delete(8) man page incorrectly describes behaviour if unfulfilled dependencies existing ports-mgmt/pkg New
194964: deskutils/xfce4-xkb-plugin 0.5.6 missing russian (winkeys) layout existing deskutils/xfce4-xkb-plugin New
194963: x11-drivers/xf86-video-ati 7.5.0 GPU lockup freezes existing x11-drivers/xf86-video-ati New
194957: x11-fonts/linux-{c6,f10}-fontconfig: linux- apps pollute user cache with system fonts framework   In Progress
194946: [New port]: databases/gomdb new databases/gomdb New
194944: [New port]: databases/hyperleveldb new databases/hyperleveldb New
194930: make index fails with "make_index: Circular dependency loop found: pulseaudio-0.9.23_3 depends upon itself." framework   Open
194923: print/ghostscript*: pkg-message outdated existing print/ghostscript8 New
194915: [PATCH] devel/monodevelop: update to 5.5 existing devel/monodevelop New
194912: graphics/pecl-imagick incorrectly handles ImageMagick library for X11 existing graphics/pecl-imagick New
194900: net/citrix_ica: does not install ICA_CERTS, inappropriate permissions, ignores home directories existing net/citrix_ica In Progress
194898: [] Change GitHub URL to comply with their API framework   Open
194861: devel/sdl20 2.0.3 cannot build existing devel/sdl20 New
194849: [new port] science/mcstas-tools-p5: Perl base utility tools for the McStas Monte Carlo neutron ray tracing package new science/mcstas-tools-p5 New
194839: www/chromium: gnome-keyring support is broken existing www/chromium New
194834: [fix] x11-fm/librfm issues, rodent too existing x11-fm/librfm Open
194800: ports-mgmt/portupgrade: broken after moving ports folder to another place existing ports-mgmt/portupgrade New
194799: [PATCH] [PORT x11/xscreensaver] Fixed 'leftover files' error in poudriere build existing x11/xscreensaver New
194798: [PATCH] [PORT sysutils/polkit] Fixed 'leftover files' error in poudriere build existing sysutils/polkit New
194797: [PATCH] [PORT sysutils/polkit] Fixed 'leftover files' error in poudriere build existing sysutils/polkit New
194778: [patch] graphics/lensfun make reinstall error existing graphics/lensfun New
194771: x11/lxde-meta & x11-wm/openbox: irc/hexchat does not shutdown on logout existing x11/lxde-meta Open
194768: ftp/wget SOCKS5 support for Tor existing ftp/wget New
194760: graphics/inkscape 0.48.5 failed compiling: Compilation failed unexpectedly existing graphics/inkscape In Progress
194749: [patch] x11/libxcb: relax python check existing x11/libxcb New
194748: [patch] x11/xcb-proto: relax python check existing x11/xcb-proto New
194745: security/openvpn: incorrect self route when using subnet topology existing security/openvpn Open
194739: x11-wm/wmfs fails to build without Xinerama and some errors in Makefile existing x11-wm/wmfs New
194738: sysutils/htop 1.0.3: Doesn't show kernel threads any more existing sysutils/htop Open
194722: ports-mgmt/portmaster fails to parse dependencies existing ports-mgmt/portmaster Open
194707: [maintainer] www/subsonic: Fix typo and missing exec/unexec in plist chunk existing www/subsonic In Progress
194705: New port: x11-drivers/xf86-video-ast, driver for graphics controller found in a recent server motherboards new x11-drivers/xf86-video-ast Open
194699: no way to disable weak ciphers in mail/imap-uw existing mail/imap-uw Open
194689: pkg needs a stand-alone equivalent to portupgrade's "pkg_sort". existing ports-mgmt/pkg New
194680: [exp-run] Update devel/bison to 3.0.2 framework   In Progress
194674: print/ghostscript9-nox11 base/unix-dll.mak:109: recipe for target 'so' failed existing print/ghostscript9-nox11 Open
194666: ports-mgmt/pkg: pkg version lists ports needing an update but update has been applied via pkg existing ports-mgmt/pkg New
194663: net/aoe and VIMAGE enabled kernel existing net/aoe Open
194660: lang/mono Add mono/metadata/mono-route.c for non-Linux ParseRouteInfo_local existing lang/mono In Progress
194652: lang/mono 3.10 build broken on CentOS 5.11 existing lang/mono New
194637: sysutils/vpnc-scripts overwrites /etc/resolv.conf instead of piping it to the resolvconf existing sysutils/vpnc-scripts New
194631: mail/milter-greylist: cannot run as user other than mailnull existing mail/milter-greylist Open
194623: fix net/libproxy, net/libproxy-webkit auto proxy configuration existing net/libproxy New
194615: Update security/libsecret to version 0.16 existing security/libsecret New
194608: [patch] databases/virtuoso service fails to start existing databases/virtuoso In Progress
194599: science/openbabel: 2.3.2 Python binding pybel does not recognize supported formats existing science/openbabel Open
194591: ports-mgmt/portmaster falsely wants to update gcc-4.7.x to gcc-4.8.x existing ports-mgmt/portmaster Open
194582: textproc/libxslt: Missing dependency on dtd-catalog existing textproc/libxslt New
194572: lang/ruby20: ruby-2.0.0-p576/lib/mkmf.rb:1820: [BUG] Segmentation fault existing lang/ruby20 In Progress
194558: [patch] Updated port devel/poco-ssl to latest release 1.4.7. existing devel/poco-ssl New
194549: sysutils/puppet27 2.7.26_1 (some kind of ruby19 complaint) existing sysutils/puppet27 In Progress
194540: [patch] Updated port devel/poco to latest release 1.4.7. existing devel/poco New
194538: editors/vim error with menu.vim existing editors/vim New
194530: cad/calculix cannot be installed via pkg existing cad/calculix New
194529: [patch] devel/ocaml-opam run depends on rsync existing devel/ocaml-opam Open
194526: sysutils/fusefs-ntfs: ntfs-3g with libublio lost files existing sysutils/fusefs-ntfs Open
194521: devel/awscli breaks with "'module' object has no attribute 'ssl_wrap_socket" after installing py27-ndg_httpsclient-0.3.2 existing devel/awscli Open
194512: Xorg hangs, with mouse autoprobe flipping and logging existing x11/xorg In Progress
194509: devel/gvfs can't automount ntfs "illegal option -- m ..." existing devel/gvfs New
194491: www/rubygem-httpclient: Bump to version 2.5.1 existing www/rubygem-httpclient New
194470: textproc/py-libxml2: simplify port existing textproc/py-libxml2 Open
194460: x11-toolkits/gtk30: add ATK_BRIDGE option existing x11-toolkits/gtk30 New
194458: Update math/suitesparse to version 4.2.1 existing math/suitesparse New
194438: textproc/docproj: DBLATEX option broken existing textproc/docproj New
194437: editors/openoffice-4 (apache-openoffioce-4.1.1_1) crashes on save, document recovery existing editors/openoffice-4 Open
194426: seahorse-tool does not decrypt unknown   In Progress
194422: graphics/gdk-pixbuf2: NLS missing from OPTIONS existing graphics/gdk-pixbuf2 New
194414: REGRESSION: www/firefox-i18n no longer depends on www/firefox at build-time, framework bug? framework   Open
194409: [new port] sysutils/glusterfs: GlusterFS distributed file system new sysutils/glusterfs In Progress
194378: [patch] cannot build japanese/mozc-server, because of incorrect PYTHONPATH existing japanese/mozc-server In Progress
194375: textproc/tinyxml2: Linking to shared object created segfault existing textproc/tinyxml2 New
194345: hald does not detect video interfaces, so cheese does not work unknown   In Progress
194337: Latest perl and SVK does not work unknown   In Progress
194327: lang/ruby20 fails to compile existing lang/ruby20 Open
194305: databases/mariadb55-server (probably mysql too) ignores datadir directive in my.cnf existing databases/mariadb55-server Open
194300: [new port] security/esteidfirefoxplugin - digital signing in Firefox with Estonian ID-card new security/esteidfirefoxplugin New
194275: databases/mariadb55-server looks in wrong place for group identifier existing databases/mariadb55-server Open
194273: ports-mgmt/pkg: no package dependency on known shlib dependency existing ports-mgmt/pkg New
194267: [patch] update sysutils/intel-pcm to v2.8 existing sysutils/intel-pcm New
194265: Using sysutils/arcconf on FreeBSD 11 Current Causes Segmentation Fault existing sysutils/arcconf Open
194247: request: check sanity check categories framework   Open
194242: mail/roundcube needs PHP fileinfo extension existing mail/roundcube Open
194239: lang/gnustep-base on arm - package needs libiconv and binaries segfault existing lang/gnustep-base In Progress
194215: [maintainer] emulators/dynagen: clean sanity check existing emulators/dynagen New
194206: sysutils/fusefs-encfs: failed to open fuse device: Permission denied existing sysutils/fusefs-encfs Open
194201: [x11-wm/spectrwm] When switching user to root using su(1) you can't jexec in a jail existing x11-wm/spectrwm New
194199: print/texlive-texmf not installing on sparc64 tinderbox existing print/texlive-texmf New
194182: [patch] devel/xdg-utils add support for Lumina DE existing devel/xdg-utils New
194153: audio/shairport: update to 1.1.1 existing audio/shairport New
194135: x11-wm/xfce4: full screen vlc doesn't hide the panel bars existing x11-wm/xfce4 Open
194130: manpage conflicts - lang/expect - net/whois existing lang/expect Open
194105: sysutils/ezjail with zfs_datasets does not work with /etc/rc.d/zfs existing sysutils/ezjail Open
194102: lang/libobjc2 on arm will not build - FreeBSD 10.x existing lang/libobjc2 In Progress
194070: graphics/podofo needs uninstall first existing graphics/podofo New
194069: cad/qcad unnecessary language dependencies existing cad/qcad New
194066: [maintainer] emulators/dynamips-community upgrade to 0.2.14 existing emulators/dynamips-community In Progress
194058: x11-toolkits/qt4-gui: bus error in qt_memfill32_sse2() on 9.3-STABLE i386 triggered by multimedia/vlc existing x11-toolkits/qt4-gui New
194047: devel/ruby-gems: only ruby19-gems are built for the official pkg repo existing devel/ruby-gems In Progress
194046: net/samba41: building Samba 4.1.x on 10.0 and 10.1-RELEASE with "DEVELOPER" option requests older/invalid gdb library existing net/samba41 In Progress
194029: net-p2p/transmission-cli: don't use bundled libraries existing net-p2p/transmission-cli In Progress
194020: archivers/engrampa port broken by py-gobject existing archivers/engrampa In Progress
194018: failed to build www/chromium 37.0.2062.124 existing www/chromium New
193995: [PATCH] ports-mgmt/pkg: floating point exception when packaging weird elf files existing ports-mgmt/pkg New
193982: net-mgmt/observium improvements, missing deps, suggestions existing net-mgmt/observium New
193974: Configuring make.conf with CC, CXX, and CPP overrides doesn't respect WITH_CCACHE_BUILD framework   Open
193956: devel/py-nose: Conflict on nosetest for multiple Python version installations existing devel/py-nose In Progress
193950: [PATCH] math/maxima: remove run-time dependency on bash existing math/maxima New
193946: emulators/virtualbox-ose: tstVMStructRC: 1: Syntax error: "(" unexpected existing emulators/virtualbox-ose New
193944: ports-mgmt/pkg: pkg version -Rv reports wrong version when two repositories in use. existing ports-mgmt/pkg New
193943: [dns/bind99] Does not compile if using LDFLAGS (when compiling using gcc49) existing dns/bind99 In Progress
193942: sysutils/mate-power-manager 1.8 crashes after update existing sysutils/mate-power-manager New
193941: www/mod_auth_mysql_another patch to work with apache24 existing www/mod_auth_mysql_another New
193924: graphics/cairo: depends on some x11 ports with update to 1.12 existing graphics/cairo New
193923: security/vuxml: |make validate| fails if ${.OBJDIR} already exists existing security/vuxml New
193922: security/vuxml: belatedly add Mozilla entry for CVE-2014-155[34] and CVE-2014-156[2-7] existing security/vuxml New
193921: misc/logsurfer: /usr/local/etc/rc.d/logsurfer: /var/log/messages: Permission denied existing misc/logsurfer New
193917: sysutils/i7z requires gcc but port does not require it existing sysutils/i7z New
193912: dns/bind99 with heimdal port brings in base heimdal libraries existing dns/bind99 In Progress
193908: security/clamtk: Update to 5.07 existing security/clamtk Open
193884: New port: devel/sumo Simulation of Urban MObility new devel/sumo In Progress
193877: net-im/skype4 existing net-im/skype4 Open
193847: make package and make clean as non-root user vs. NEED_ROOT=yes framework   New
193844: Please make sure that pkg adds itself in BUILD_DEPENDS, too. framework   Open
193809: mail/notmuch crashes when indexing new mail existing mail/notmuch Open
193798: net-im/skype obsolete version, but problem on upgrade to newer existing net-im/skype Open
193778: [patch] emulators/virtualbox-ose: make VNC listen on same port for IPv6 and IPv4 existing emulators/virtualbox-ose New
193770: CURRENT/UEFI: x11/nvidia-driver: loading module via loader.conf freezes system existing x11/nvidia-driver New
193732: [patch] ports-mgmt/poudriere-devel suppress sort warning on FreeBSD < 10 existing ports-mgmt/poudriere-devel New
193726: x11/xorg crashes on miscofiguration of xorg.conf existing x11/xorg New
193716: ports-mgmt/portmaster attempts to install port before required port existing ports-mgmt/portmaster Open
193714: [NEW PORT] cad/systemc: Modeling platform for system-level C++ models new cad/systemc Open
193706: [new port] devel/apache-spark: high performance distributed computing system new devel/apache-spark Open
193700: www/otrs may set permission during install existing www/otrs In Progress
193695: www/rubygem-passenger: packaging failure with SYMLINK option set existing www/rubygem-passenger New
193652: [patch] update www/xpi-noscript existing www/xpi-noscript New
193641: sysutils/bacula-server does not upgrade nicely with shared libraries existing sysutils/bacula-server Open
193636: print/cups: Shared CUPS-printers are not visible to Debian-clients with FreeBSD 10.0 existing print/cups Open
193629: sysutils/exfat-utils is marked as restricted without maintainer approval existing sysutils/exfat-utils Open
193627: [change-request] x11/xscreensaver: New hack, optional NLS. existing x11/xscreensaver New
193625: www/webkit-gtk3: Update to 2.4.4, Make NLS and HTML docs conditional for multiple ports existing www/webkit-gtk3 Open
193617: sysutils/bacula-server 7.0+ lost LIBEDIT/LIBREADLINE on bconsole existing sysutils/bacula-server Open
193610: www/chromium 37.0.2062.120_1 Bus error (core dumped) existing www/chromium New
193552: www/mod_log_config-st [maintainer] support for recent PATCH existing www/mod_log_config-st Open
193534: [MAINTAINER UPDATE] net-p2p/namecoin existing net-p2p/namecoin In Progress
193528: [PATCH] lang/gcc*: c++11 support is broken existing lang/gcc In Progress
193527: [patch] check-already-installed hitting conflicts with ports that have same PKGBASE framework   New
193522: [PATCH] mail/sympa: update to 6.1.23 existing mail/sympa Open
193504: [NEW PORT] finance/quickfix: open source FIX protocol implementation new finance/quickfix In Progress
193482: security/openssl - new "no-ssl2" feature breaks at least one dependent port existing security/openssl New
193481: emulators/open-vm-tools does not compile on some systems because of undefined DIRSEPS existing emulators/open-vm-tools New
193475: java/openjdk7 jinfo and jmap do not work existing java/openjdk7 Open
193474: security/webshag: some ports improvements. existing security/webshag In Progress
193469: defective crypt() implementation affects www/apache24, possibly www/apache22 existing www/apache24 In Progress
193468: databases/py-geoalchemy2: Switch to stable databases/py-sqlalchemy existing databases/py-geoalchemy2 Open
193459: www/mod_security dependency on db48 shared library is missing existing www/mod_security In Progress
193435: Enhance EXTRA_PATCHES so that it can contain directories as well as files. framework   Open
193433: x11-toolkits/gtk20: Makefile uses Python 2.7_2,2, causes openshot to fail with erroneous missing libmp3lame claim existing x11-toolkits/gtk20 Open
193395: graphics/gphoto2: Segmentation fault (core dumped) on file upload existing graphics/gphoto2 Open
193394: x11-wm/ede/: ede-keyboard-conf was compiled without XKB extension. existing x11-wm/ede Open
193391: x11/xorg: Radeon 9600pro hardware acceleration doesn't work with KMS version Xorg.(WITH_NEW_XORG) existing x11/xorg In Progress
193373: [PATCH] audio/xanalyser: Does not use appropriate OSS IOCTLs existing audio/xanalyser In Progress
193371: knob to force deinstall of previous version of port before building the new version framework   Open
193350: [NEW PORT] devel/py-ta-lib: Python wrapper for TA-Lib new devel/py-ta-lib Open
193349: Ports not properly depending on openldap-sasl-client unknown   New
193336: textproc/qt4-xmlpattern: Compile error on 10.0-RELEASE amd64: unable to execute command: Killed existing textproc/qt4-xmlpatterns New
193331: graphics/libcdr-0.0.16_1 fails to build with clang on 9.2-RELEASE existing graphics/libcdr01 Open
193318: editors/abiword fails when built with gcc47 existing editors/abiword Open
193306: [NEW PORT] japanese/tex-xdvik: DVI Previewer for X + freetype support new japanese/tex-xdvik Open
193299: devel/valgrind: doesn't recognise the netmap ioctls existing devel/valgrind Open
193295: devel/valgrind: Doesn't decode instruction(s) when libunwind is used existing devel/valgrind Open
193289: print/texlive-base fails to build on powerpc64 existing print/texlive-base Open
193250: deleting TeX related packages leaves removed file names in ls-R files framework   Open
193230: [patch] cad/iverilog plist issues if port is already installed existing cad/iverilog Open
193227: www/serf: Package pulling in unnecessary dependencies (possible pkg repo corruption) existing www/serf In Progress
193221: net/relayd 100% cpu when answering TLS requests existing net/relayd Open
193210: net/boinc-client fails to build on 11-CURRENT existing net/boinc-client Open
193200: [patch] www/suphp - add support for apache 2.4 existing www/suphp Open
193148: [databases/php55-dba] patch for db6 compatibility existing databases/php55-dba Open
193140: fix confliction of japanese/dvi2tty existing japanese/dvi2tty In Progress
193137: devel/git: Use CONFIGURE args for ICONV support, Sort pkg-plist existing devel/git Open
193127: [PATCH] security/openssh-portable should allow a plain protocol version string existing security/openssh-portable In Progress
193120: [] erroneously poisons CPPFLAGS with -L${LOCALBASE}/lib framework   New
193117: x11-toolkits/vtkfox: doesn't build with FOX17 existing x11-toolkits/vtkfox Open
193106: New-port: emulators/linux_base-f20 : Add a port with the base libraries for Fedora 20. new emulators/linux_base-f20 In Progress
193105: editors/hexpert depends on LIBCURSES/-lcurses; needs to depend on LIBNCURSES/-lncurses existing editors/hexpert Open
193101: Cannot get www/chromium work existing www/chromium Open
193084: ports-mgmt/pkg-1.3.7 pkg updating pkg-name matches not reliable existing ports-mgmt/pkg Open
193083: security/sslscan incompatible with new "no-ssl2" feature of security/openssl port existing security/sslscan Open
193082: [patch] Mk, keywords: Don't run expensive font commands when building packages framework   In Progress
193079: [patch] audio/squeezeboxserver: does not work with default mysql version existing audio/squeezeboxserver Open
193073: [PATCH]: devel/anjuta broken for version autogen 5 not found existing devel/anjuta In Progress
193050: math/p5-Bit-Vector uses base cc for linking, causing build failure when using USE_GCC=yes existing math/p5-Bit-Vector In Progress
193049: devel/cmake fails to link when built with gcc47 existing devel/cmake Open
193016: ports-mgmt/pkg: pkg upgrade does not use latest version from repo existing ports-mgmt/pkg Open
193004: -nox11 ports should depends on -nox11 ports framework   Open
193002: regression? WITH_BDB_VER=6 in /etc/make.conf breaks devel/Ice before it worked around the issue framework   Open
193000: BerkeleyDB related fallout (master bug) framework   Open
192990: 192990 framework      
192960: ports-mgmt/portmaster dependency handling is incorrect. existing ports-mgmt/portmaster Open
192959: archivers/php5-zip: zipArchive seg fault on archive read existing archivers/php5-zip Open
192956: uwsgi can't set uwsgi_uid/uwsgi_gid to 0 in rc.conf existing www/uwsgi Open
192953: [patch] x11/nvidia-settings: update to 340.32 existing x11/nvidia-settings In Progress
192949: packaged ruby gems contain source and intermediate build output unknown   New
192946: put tailored copies of , , etc in Mk/ framework   Open
192937: [New Port] sysutils/consul new sysutils/consul In Progress
192928: /usr/lib/ version GLIBCXX_3.4.11 required by /usr/local/share/chromium/chrome not found unknown   Open
192925: lang/php5: php-fpm.conf: socket ownership / missing UPDATING notice existing lang/php5 Open
192904: www/nginx: OPTION'ally support SPNEGO via 3rd party http_auth_gss module existing www/nginx Open
192876: mail/qmail-tls doesn't compile with smtp auth existing mail/qmail-tls Open
192859: net-im/kopete-kde4 doesn't build if net/libilbc installed existing net-im/kopete-kde4 Open
192852: sysutils/fusefs-libs: ignore |automounted| option used by autofs existing sysutils/fusefs-libs In Progress
192848: www/owncloud: pkg-msg is advertising a missing file existing www/owncloud Open
192843: www/chromium build failure openssl clash with cups existing www/chromium Open
192836: x11/xdm locks up after logging out of Xorg (Intel driver, WITH_NEW_XORG) existing x11/xdm Open
192832: net-mgmt/nfsen: perl uid 80 exited on signal 11 existing net-mgmt/nfsen Open
192826: [PATCH] databases/redis: fix for luajit patch existing databases/redis Open
192784: failed to build www/chromium 36.0.1985.143 on FreeBSD 10 (amd64) existing www/chromium Open
192779: www/xombrero -1.6.3 build failed settings.o existing www/xombrero Open
192777: Mk/Scripts/ can create a sed call that's too long framework   New
192750: www/chromium 36.0.1985.143 has larger fonts than normal on tabs and menus existing www/chromium Open
192749: www/chromium 36.0.1985.143 shows normally hidden window manager decorations existing www/chromium Open
192724: [patch] devel/gnome-vfs: doesn't completely ignore auto detect of sys/inotify.h existing devel/gnome-vfs Open
192723: databases/mysql55-client fails to build existing databases/mysql55-client Open
192708: irc/unreal: QWEBIRC failing connection to UnrealIRCd server. existing irc/unreal In Progress
192706: ports/Tools/scripts/ overhaul, includes limiting to direct dependencies framework   New
192670: pkg upgrade sometimes shows wrong count of packages in progress existing ports-mgmt/pkg Open
192657: [patch] databases/mysql56-server rc script fails to (one)start existing databases/mysql56-server Open
192643: print/texlive-base and print/ps2eps conflict existing print/texlive-base Open
192628: firefox/thunderbird/seamonkey intermittent crashes during install on 8.4R amd64 unknown   New
192617: [NEW PORT] x11/nvidia-driver-optimus new x11/nvidia-driver-optimus In Progress
192614: [patch] lang/spidermonkey* : add DTRACE option existing lang/spidermonkey17 Open
192610: x11-toolkits/pango cannnot open lib/pango/1.6.0/modules/ warning existing x11-toolkits/pango Open
192580: security/ossec-hids-server: Fix compile under 11.0 after switching readline to INTERNALLIB existing security/ossec-hids-server Open
192575: [patch] java/junit: fix build of 4.11 with openjdk8 existing java/junit Open
192572: [patch] audio/paprefs: update to 0.9.10 existing audio/paprefs Open
192568: www/nginx: Does not build existing www/nginx New
192566: [NEW PORT] www/ezpublish: Community edition of eZ Publish, a CMS / CEM platform new www/ezpublish In Progress
192553: [patch] teach security/tor and security/tor-devel to reload existing security/tor Open
192540: Made port config dialog more informative: show overidden flag and non-default selection flag framework   Open
192537: Port Update: devel/boost-* existing devel/boost-all Open
192526: sysutils/bacula-client 7.0.4_1 and sysutils/bacula-server 7.0.4_1 don't compile on 10-STABLE when 5.x is already installed. existing sysutils/bacula-client Open
192515: www/havp LibClamAV Error: Can't load /var/db/clamav/daily.cvd: Can't allocate memory existing www/havp Open
192511: lang/python27: Fix build with LibreSSL existing lang/python27 Open
192497: [PATCH] textproc/clit: broken MASTER_SITES existing textproc/clit In Progress
192488: lang/ruby20 segmentation fault/coredump existing lang/ruby20 Open
192474: www/firefox coredumps (bus error) when touching toolbar or resizing window existing www/firefox Open
192469: textproc/goldendict: when importing BGL format dictionary it eats much memory, and finally crashes existing textproc/goldendict Open
192468: [PATCH] editors/libreoffice: deadlocks to render EPS file using GS existing editors/libreoffice Open
192414: www/firefox-31.0,1 fails to build existing www/firefox-esr In Progress
192387: [PATCH] databases/postgresql91-server: missing OSSP_UUID option existing databases/postgresql91-server Open
192381: devel/glib20 option COLLATION_FIX is poorly described existing devel/glib20 Open
192380: ports-mgmt/portlint: needs to report wrong order of categories existing ports-mgmt/portlint In Progress
192359: emulators/virtualbox-ose-additions 11.0-CURRENT VBoxService doesn't start existing emulators/virtualbox-ose-additions Open
192308: multimedia/xawtv: some options BROKEN existing multimedia/xawtv Open
192305: java/jamvm: 1.5.4 -> 2.0.0 existing java/jamvm In Progress
192298: net/dhcprelya consumes cpu on FreeBSD 10 existing net/dhcprelya In Progress
192297: [openldap24-server] post-patch CFLAGS injection fails because of bad sed separator existing net/openldap24-server Open
192290: port snap having odd ball char count unknown   Open
192275: net/relayd checks for "/dev/pf" when only doing layer 7 relaying. existing net/relayd Open
192274: net/relayd does not start when ipv6 address is not present. existing net/relayd Open
192232: [ports-mgmt/portupgrade] Added 'security vulnerability' to the reasons of failure. existing ports-mgmt/portupgrade Open
192186: security/libsodium lacks libexecinfo linkage existing security/libsodium Open
192182: Message: conversion from UTF-8 to UTF-8 unsupported existing multimedia/mencoder In Progress
192176: www/mod_dav_svn: Cannot compile this port against apache24: sqlite3 misses .la file existing www/mod_dav_svn In Progress
192157: [PATCH] print/ghostscript9 missing SVGALIB option existing print/ghostscript9 Open
192118: misc/freebsd-doc-es: why require chinese/arphicttf, chinese/ttfm, japanese/font-ipa... existing misc/freebsd-doc-es Open
192106: editors/emacs-devel fails to compile with linker error existing editors/emacs-devel In Progress
192080: [PATCH] supply -L in addition to -Wl,-rpath framework   Open
192075: [mail/exim] fails when using a custom EXIM_USER existing mail/exim Open
192020: sysutils/cdrtools extract broken existing sysutils/cdrtools Open
192012: [New ports] devel/tianocore-udk2010 devel/tianocore-udk2014 emulators/tianocore-ovmf-ia32 emulators/tianocore-ovmf-x64: Tools for UEFI application and driver development new devel/tianocore-udk2010 In Progress
191998: x11/kdelibs4 non-necessary dependency to avahi existing x11/kdelibs4 New
191988: ftp/wget: Fails to work with LibreSSL existing ftp/wget Open
191973: [patch] sysutils/consolekit fails to build because of incorrect LIB_DEPENDS update existing sysutils/consolekit Open
191949: Lookup-specific subports of mail/exim do not have default lookup options existing mail/exim New
191919: security/ipsec-tools does not honor WITH_OPENSSL_PORT existing security/ipsec-tools In Progress
191912: devel/pear-PHP_CodeSniffer: Additional dependencies required existing devel/pear-PHP_CodeSniffer Open
191905: net/3proxy: Authorization does not work in 3proxy-0.6.1 (091211143921) existing net/3proxy Open
191903: New port: cad/cura (A complete slicing solution for RepRap 3D printers) new cad/cura In Progress
191902: [update] net-mgmt/tcptrack doesn't build and when patched, segfaults existing net-mgmt/tcptrack In Progress
191901: security/p5-Crypt-SSLeay 0.72 fails to build with CC=clang in /etc/make.conf existing security/p5-Crypt-SSLeay Open
191885: I have patched x11-fm/caja to solve a desktop text rendering issue ( existing x11-fm/caja Open
191873: Network ports in category "multimedia" unknown   In Progress
191801: net/samba41 man install files not found existing net/samba41 In Progress
191790: Uses/ add readline:edit for base libedit with libreadline compat headers framework   New
191750: [revive port] archivers/xz -> 5.0.5, MAINTAINERSHIP, MIRROR new archivers/xz In Progress
191741: math/py-numpy: Enable ATLAS option by default. Fixes science/py-scipy & science/avogadro packages existing math/py-numpy In Progress
191733: editors/libreoffice fails postgresql-client check existing editors/libreoffice Open
191679: [PATCH] sysutils/apcupsd add LICENSE,fix typo existing sysutils/apcupsd New
191661: x11-toolkits/py-gnome-desktop fails installation No such file or directory unknown   New
191642: comms/wspr does not build properly existing comms/wspr New
191632: x11-servers/xorg-server: kernel: sysmouse: unknown ioctl: t:40007413 existing x11-servers/xorg-server New
191622: x11-fm/thunar: Thunar FM occasionally freezes when "View->Side Pane->Tree" is selected existing x11-fm/thunar Open
191560: x11/gdm depends security/gnome-keyring existing x11/gdm New
191552: [patch] sysutils/apcupsd: Add PDF distfile checksum, Unmark BROKEN existing sysutils/apcupsd Open
191548: devel/cvs fails with ports texinfo existing devel/cvs In Progress
191547: Flag PKG_ADD_USE_UPGRADE_SCRIPTS have never be set in pkgng existing misc/flag New
191514: print/cups-base does not install files for web UI if OPTIONS_UNSET+=DOCS specified in make.conf existing print/cups-base Open
191507: build failure with graphics/dia existing graphics/dia New
191489: devel/qt4-assistant-4.8.6 fails with undefined reference to `std::__detail::_List_node_base::_M_unhook()' existing devel/qt4-assistant New
191480: ports-mgmt/pkg: pkg version locks database too long existing ports-mgmt/pkg New
191476: lang/luajit not linked against pthread existing lang/luajit New
191461: Stage-enabled ports are not installed at all when NO_PKG_REGISTER is used. framework   New
191454: [ update,patch ] java/bouncycastle is obsolete version existing java/bouncycastle In Progress
191451: audio/sdl_sound: Improvement patch Timidity selection existing audio/sdl_sound Open
191442: databases/py-sqlalchemy: Copy to py-sqlalchemy07, Update to 0.9.7, Remove -devel existing databases/py-sqlalchemy Open
191424: sysutils/cdrtools broken on powerpc64 existing sysutils/cdrtools In Progress
191404: [UPDATE] security/tor-devel to existing security/tor-devel New
191401: graphics/py-cairo: enable xpyb support existing graphics/py-cairo In Progress
191381: emulators/virtualbox-ose-kmod installs bad RC script with circular dependency existing emulators/virtualbox-ose-kmod Open
191379: [PATCH] www/nginx: drizzle module broken existing www/nginx New
191355: xfce ?? unknown   Open
191352: ports-mgmt/pkg v 1.2.7_3 does not honor the HTTP_PROXY_AUTH variable. existing ports-mgmt/pkg Open
191328: x11-wm/qtile fails to run (depend error) existing x11-wm/qtile New
191296: x11/xdm fails to start xfce4 existing x11/xdm In Progress
191275: x11-wm/openbox does not change desktop size when xrandr changes resolution existing x11-wm/openbox New
191273: [patch] BUILD_RUN_DEPENDS convenience helper framework   New
191230: net/isc-dhcp43-server configure errors existing net/isc-dhcp43-server New
191193: editors/emacs fails to build (May be graphics/ImageMagick issue) existing editors/emacs In Progress
191190: [patch] audio/alsa-lib: Change headers to use defines supplied by the base system. existing audio/alsa-lib Open
191176: comms/gammu with mysql installed existing comms/gammu Open
191166: [patch] ports-mgmt/portmaster: update man page for rebuilding all ports with pkg existing ports-mgmt/portmaster New
191147: Building java/openjdk6 on FreeBSD CURRENT (amd64) fails existing java/openjdk6 Open
191144: [patch] Mk/ Add opt_IMPLIES and opt_PREVENTS framework   In Progress
191106: ports-mgmt/fastest_sites: references nonexistent python binary in shebang existing ports-mgmt/fastest_sites New
191087: graphics/libchamplain fails to build with warning missing ':' at mult. columns on amd64 existing graphics/libchamplain New
191035: [PATCH] print/texlive-base: Add shebangfix for scripts existing print/texlive-base New
190981: archivers/kzip possible licensing issue existing archivers/kzip In Progress
190971: [PATCH] databases/postgresql92-server: switch to USES instead of USE_BZIP2 existing databases/postgresql92-server New
190969: [PATCH] games/warsow: Update to v1.51 existing games/warsow In Progress
190961: devel/p5-subversion polluted packlist existing devel/p5-subversion In Progress
190930: Mk/ make generate-plist called after make all overwrite plist incompletly (at least rcd is missing) framework   New
190922: databases/ruby-bdb fails to configure - n `remove_const': constant Object::CONFTEST_C not defined (NameError) existing databases/ruby-bdb New
190836: update devel/quilt to version 0.63 existing devel/quilt In Progress
190817: net/vnstat should provide a -nox11 binary package existing net/vnstat New
190813: devel/kBuild fails to build with GCC 4.8 or 4.9 existing devel/kBuild New
190796: Patch for sysutils/rubygem-facter to add interface alias support existing sysutils/rubygem-facter New
190790: [patch] net-mgmt/nrpe fix build with ssl (.rnd file placement) existing net-mgmt/nrpe New
190756: www/linux-f10-flashplugin11 in virtualbox shows play speed increase even with emulators/rtc installed on amd64 existing www/linux-f10-flashplugin11 New
190755: emulators/virtualbox-ose-additions vboxguest fails to start on amd64 existing emulators/virtualbox-ose-additions New
190752: www/linux-f10-flashplugin11 in virtualbox shows play speed increase without emulators/rtc installed existing www/linux-f10-flashplugin11 New
190747: ftp/pure-ftpd starts two instances of uploadscript on reboot existing ftp/pure-ftpd New
190740: webplugin sym links broken (e.g., multimedia/totem) framework   In Progress
190732: mDNSresponder does not advertise services/ignores conf file existing net/mDNSResponder New
190729: [UPDATE] sysutils/zeitgeist to 0.9.14 existing sysutils/zeitgeist In Progress
190725: net-mgmt/aircrack-ng Makefile bug, wouldn't build with SQLITE option set. existing net-mgmt/aircrack-ng New
190704: emulators/virtualbox-ose-additions vboxguest leak memory resources with PAE kernel existing emulators/virtualbox-ose-additions New
190637: archivers/lrzip 0.616_1 build fails existing archivers/lrzip Open
190629: authentication bypass in net/pear-Horde_Ldap existing net/pear-Horde_Ldap New
190561: www/rubygem-passenger: Registering installation for rubygem-passenger-4.0.44 Error code 74 existing www/rubygem-passenger New
190532: ports-mgmt/portmaster needs new debug option existing ports-mgmt/portmaster New
190531: misc/p5-I18N-LangTags - uses deprecated syntax existing misc/p5-I18N-LangTags New
190475: net/asterisk11 fails to build after lang/lua transition existing net/asterisk11 New
190466: multimedia/x264 fails to catch -march=corei7 properly, setting march=mtune existing multimedia/x264 In Progress
190434: print/cups-base tries to build icons when building headless existing print/cups-base In Progress
190432: emulators/virtualbox-ose pulls unnecessary Qt libraries when building headless existing emulators/virtualbox-ose In Progress
190417: emulators/virtualbox-ose vboxsf Operation not supported by device existing emulators/virtualbox-ose Open
190336: www/squidclamav crashes on signal 10 existing www/squidclamav In Progress
190332: net/pptpclient fails with "/bin/ip: not found" existing net/pptpclient In Progress
190304: www/chromium 35.0.1916.114. Problem with YouTube existing www/chromium In Progress
190302: New ports: databases/derby RDBMS `Apache Derby' new databases/derby Open
190276: sysutils/puppet agent wrongly calculates INDEX uri existing sysutils/puppet In Progress
190268: Request for multimedia/zoneminder update existing multimedia/zoneminder In Progress
190232: cad/kicad-devel compilation error in math_util.cpp existing cad/kicad-devel In Progress
190160: net/slurm does not display interface speed for gigabit NICs existing net/slurm In Progress
190157: devel/glib20: Fix build error when installed ports/lang/gcc existing devel/glib20 In Progress
190111: www/rubygem-passenger: is not installed existing www/rubygem-passenger In Progress
190110: mail/sympa post-install instructions are wrong existing mail/sympa Open
190106: [update] games/alephone to 20140104 existing games/alephone In Progress
190104: Patch to make databases/ip4r prefer indexes on large (ie in production) databases existing databases/ip4r In Progress
190074: www/nginx github/agentzh and github/chaoslawful dependencies have been moved to github/openresty existing www/nginx In Progress
190065: New port: net-p2p/py-transmission-remote-curses Remote Curses UI for Transmission daemon new net-p2p/py-transmission-remote-curses In Progress
190017: graphics/py-cairo fails to compile when python2.7 compiled with -march existing graphics/py-cairo In Progress
189953: [PATCH] sysutils/syslog-ng: fix enable SPOOF option and microfix existing sysutils/syslog-ng In Progress
189952: [PATCH] sysutils/syslog-ng: enable SPOOF option and many fix existing sysutils/syslog-ng In Progress
189946: devel/dbus-qt4 sparc64 build failure: ../../include/QtCore/../../src/corelib/arch/qatomic_generic.h:197: error: invalid conversion from 'const void*' to 'void*' existing devel/dbus-qt4 In Progress
189944: misc/qt4-doc sparc64 build failure: Killing timed out build after 3600 seconds existing misc/qt4-doc In Progress
189934: [patch] databases/postgresql-jdbc update to 9.3.1101 existing databases/postgresql-jdbc In Progress
189907: [maintainer update] games/mangband existing games/mangband In Progress
189879: Adding GNU Readline support for security/krb5 existing security/krb5 In Progress
189852: x11/workrave fails to build on FreeBSD 10 existing x11/workrave In Progress
189849: Upgrade of lang/newlisp to 10.6.0 fails existing lang/newlisp In Progress
189838: net/openvswitch 1.7.1 : ovsdb-tool create segfaults existing net/openvswitch In Progress
189829: New Port: games/tesseract new games/tesseract In Progress
189811: security/ca_root_nss: Add (cert.pem) symlinks to support OpenSSL verification by default existing security/ca_root_nss In Progress
189731: www/nginx: Postgres extension is disabled in nginx 1.6 port existing www/nginx In Progress
189676: net-im/mcabber window resize broken by MFV r262639: ncurses 5.9 20140222 snapshot. existing net-im/mcabber In Progress
189528: sysutils/xcdroast cannot find cd-rom drive existing sysutils/xcdroast In Progress
189482: security/sudo: grep: /usr/local/lib/ No such file or directory existing security/sudo In Progress
189469: [update,patch] misc/fxload patch for xilinx.conf devd rules existing misc/fxload In Progress
189443: [New port] sysutils/amttool: Split off amttool from comms/amtterm new sysutils/amttool Open
189440: www/nginx: lua-nginx-module-v0.9.4-0 size mismatch existing www/nginx In Progress
189424: converters/wkhtmltopdf needs x11-fonts/xorg-fonts existing converters/wkhtmltopdf In Progress
189401: New port: sysutils/amtc -- Threaded Intel AMT/vPro mass management tool new sysutils/amtc Open
189393: [patch] www/nginx: update tcp_proxy module existing www/nginx In Progress
189384: databases/postgis21 doesn't compile, and doesn't function when compiled without RASTER existing databases/postgis21 Open
189362: graphics/libchamplain fails to build if older version installed existing graphics/libchamplain In Progress
189327: [new port] www/agilebill: a complete billing solution for ISPs and a-like. new www/agilebill In Progress
189319: [patch] net-im/empathy now builds ok without MAKE_JOBS_UNSAFE existing net-im/empathy In Progress
189266: devel/gobject-introspection fails to build due to missing python headers existing devel/gobject-introspection In Progress
189212: emulators/virtualbox-ose: netboot of a virtualbox diskless client hangs at pxeboot (iPXE) existing emulators/virtualbox-ose In Progress
189206: [patch] audio/pulseaudio is sound enough to parallel build existing audio/pulseaudio In Progress
189202: [patch] devel/gobject-introspection is sound enough to parallel build existing devel/gobject-introspection In Progress
189163: x11/xorg: Could not init font path element /usr/local/lib/X11/fonts/* existing x11/xorg In Progress
189136: multimedia/libvpx fails to build on freebsd10/i386 with gcc existing multimedia/libvpx In Progress
189126: graphics/sane-backends silently installs pkgng and screws everything up existing graphics/sane-backends In Progress
189121: [new port] ftp/mod_vroot, module for ProFTPd new ftp/mod_vroot In Progress
189118: multimedia/vlc with VAAPI SIGSEGVs after playback ends existing multimedia/vlc In Progress
189113: x11-servers/xorg-vfbserver: Bug in Xvfb using RANDR extension existing x11-servers/xorg-vfbserver In Progress
189106: devel/9base yacc needs to install yaccpar and yaccpars existing devel/9base In Progress
189104: net/tcpdump not logging packets to guests of the VirtualBox existing net/tcpdump In Progress
189058: multimedia/webcamd: Lenovo Thinkpad E530 webcam doesn't detected by webcamd existing multimedia/webcamd In Progress
189055: astro/google-earth: call to unneeded graphics/linux-f10-dri on nvidia system existing astro/google-earth In Progress
189054: mail/thunderbird: lightning calendar extension: Without localization existing mail/thunderbird In Progress
189019: mail/exim: Perl is always needed for build existing mail/exim In Progress
188998: www/nginx package not found on unknown   In Progress
188982: /usr/ports/emulators/virtualbox-ose error making v. 4.3.10 existing emulators/virtualbox-ose In Progress
188974: [PATCH] archivers/star - reverse depreciation due to patch 188472 which fixes devel/smake existing devel/smake In Progress
188973: graphics/libetonyek uses wrong gperf unknown   In Progress
188967: [update] [patch] [fix] www/nginx-devel tcp_proxy module existing www/nginx-devel In Progress
188966: [patch] [update] www/nginx TCP_PROXY module 0.4.5 existing www/nginx In Progress
188941: sysutils/dmidecode: proposed daily periodic script existing sysutils/dmidecode In Progress
188938: New port: net-mgmt/nsca-ng Monitoring command acceptor new net-mgmt/nsca-ng Open
188924: devel/binutils installs non-functional bfd.h existing devel/binutils In Progress
188920: NEW-MAINTAINER, MASTER_SITES -- salvage www/cherokee existing www/cherokee In Progress
188900: multimedia/totem fails to build on 9.2-RELEASE existing multimedia/totem In Progress
188841: print/ghostscript9 (9.06) fails to build existing print/ghostscript9 In Progress
188840: [UPDATE] textproc/link-grammar to 5.0.6 existing textproc/link-grammar In Progress
188826: sysutils/pftop broken on -CURRENT existing sysutils/pftop In Progress
188780: [ patch ] misc/dahdi-kmod: rc.d/dahdi start doesn't initialise properly existing misc/dahdi-kmod In Progress
188778: [ patch ] net/asterisk11 unpublished dependency to multimedia/libv4l and multimedia/ffmpeg existing net/asterisk11 In Progress
188752: [patch] www/ update to version 3.65 existing www/ In Progress
188708: [] ports framework CONFLICT_INSTALL regression with staged ports framework   In Progress
188693: [] OPTIONS_SINGLE: bug allows user to choose two single options simultaneously framework   In Progress
188679: sysutils/cfengine hard-coded passwords in 3.5.3 existing sysutils/cfengine In Progress
188621: Cannot build net/opal when multimedia/ffmpeg is installed existing net/opal In Progress
188596: textproc/py-libxml2 fails to build existing textproc/py-libxml2 In Progress
188566: I have updated x11-drivers/xf86-video-vmware to 13.0.2 existing x11-drivers/xf86-video-vmware In Progress
188522: [PATCH] devel/libgsf fix installation of GObject Introspection files existing devel/libgsf In Progress
188464: [PATCH] sysutils/apcupsd: update to 3.14.12 existing sysutils/apcupsd In Progress
188437: New port: security/softether new security/softether In Progress
188419: [exp-run] Uses/ improvements part 1 framework   In Progress
188398: mail/thunderbird - clang fails to build with qt existing mail/thunderbird In Progress
188384: [patch] Fix broken port devel/poco-ssl existing devel/poco-ssl In Progress
188383: x11-drivers/xf86-video-openchrome 0.3.3 crash on HP t5540 existing x11-drivers/xf86-video-openchrome In Progress
188376: print/cups-base: No such file or directory when try printing TESTPAGE existing print/cups-base In Progress
188374: net/3proxy update to existing net/3proxy In Progress
188293: security/tor: When starting Tor, I get: "Failed to parse/validate config: Failed to init Log options" existing security/tor In Progress
188291: [PATCH] misc/shared-mime-info: silence update-mime-database execution existing misc/shared-mime-info In Progress
188282: Please update finance/aqbanking because of missing SEPA support existing finance/aqbanking In Progress
188264: [patch] No way to paste primary selection in GTK Programs using x11-toolkits/gtk20 and x11/toolkits/gtk30 existing x11-toolkits/gtk20 In Progress
188259: dns/p5-Net-Domain-TLD out of date existing dns/p5-Net-Domain-TLD In Progress
188251: lang/python: bdb48 dependency leak in all python existing lang/python In Progress
188183: [New port] databases/mysql55-galera-client: Multithreaded SQL database with wsrep patch (client) new databases/mysql55-galera-client In Progress
188182: [New port] databases/mysql55-galera-server: Multithreaded SQL database with wsrep patch (server) new databases/mysql55-galera-server In Progress
188181: [New port] databases/mysql56-galera-server: Multithreaded SQL database with wsrep patch (server) new databases/mysql56-galera-server In Progress
188180: [New port] databases/mysql56-galera-client: Multithreaded SQL database with wsrep patch (client) new databases/mysql56-galera-client In Progress
188179: [New port] databases/mariadb55-galera-server: Multithreaded SQL database with wsrep patch (server) new databases/mariadb55-galera-server In Progress
188178: [New port] databases/mariadb55-galera-client: Multithreaded SQL database with wsrep patch (client) new databases/mariadb55-galera-client In Progress
188148: [PATCH] devel/py-virtualenv add support for pypy existing devel/py-virtualenv In Progress
188130: port devel/py-dbus compile but not install (missing files) existing devel/py-dbus In Progress
188110: [NEW PORT] devel/maven32 new devel/maven32 Open
188088: editors/openoffice-4 4.0.1 crash on format cells existing editors/openoffice-4 Open
188059: make config-recursive behavior framework   Open
188056: print/ghostscript8-nox11 8.71_14 undef ref `lips_mode3format_encode' existing print/ghostscript8-nox11 In Progress
188051: audio/nas segfaults existing audio/nas In Progress
188026: www/firefox: 11.0-CURRENT r262690 ia64, ports tree at 349321: build failure: errors.fatal('Error while running startup cache precompilation') existing www/firefox In Progress
187978: net/mrouted's IGMP code are broken. existing net/mrouted In Progress
187963: graphics/shotwell is crashing existing graphics/shotwell In Progress
187952: multimedia/mythtv installation error existing multimedia/mythtv In Progress
187924: [PATCH] sysutils/apcupsd: Use shutdown -p rather than -h existing sysutils/apcupsd In Progress
187922: sysutils/zfs-snapshot-mgmt 20090201_2 stopped working with FreeBSD10 existing sysutils/zfs-snapshot-mgmt In Progress
187884: [PATCH] science/minc2: update to 2.2.00 existing science/minc2 In Progress
187846: security/krb5 doesn't buld because of various compiler errors existing security/krb5 In Progress
187843: devel/shiboken error: no member named 'tr1' in namespace 'std' existing devel/shiboken In Progress
187722: devel/dconf 0.14.1 fails to build existing devel/dconf In Progress
187697: [revive port] sysutils/hdup new sysutils/hdup In Progress
187685: textproc/flex: removal of may break other ports existing textproc/flex In Progress
187564: New port: math/mathgl; high-quality graph plotting library written in C++ new math/mathgl Open
187561: devel/subversion: bogus "No route to host" caused by www/serf existing devel/subversion In Progress
187558: x11/gdm port should not overwrite pam.d/gdm if it exists existing x11/gdm In Progress
187541: Re: [PATCH] chinese/fcitx: update to existing chinese/fcitx In Progress
187533: Can't build devel/dconf 0.14.1_1 existing devel/dconf In Progress
187532: lang/ghc: ghc-7.6.3_3 does not install existing lang/ghc In Progress
187474: net/freerdp: xfreerdp clipboard broken on 10-RELEASE existing net/freerdp In Progress
187464: ports-mgmt/pkg: pkg-1.2.6 depends on periodic.conf vars from 9 and lower existing ports-mgmt/pkg In Progress
187463: www/webkit-qt4 uses base g++ as linker existing www/webkit-qt4 In Progress
187403: print/texlive-base: TeXLive does not register opentype fonts for use by fontspec existing print/texlive-base In Progress
187401: astro/gpsd fails to include existing astro/gpsd In Progress
187367: www/joomla31: Joomla 3.x port misses pgsql support existing www/joomla31 In Progress
187358: security/pam_krb5 does not build against ports heimdal existing security/pam_krb5 In Progress
187346: switch editors/emacs over to gnutls3 existing editors/emacs In Progress
187334: Updating databases/redis via portmaster deletes redis.conf existing databases/redis In Progress
187304: multimedia/libvpx: allow building with zsh existing multimedia/libvpx In Progress
187299: ports-mgmt/pkg: pkg-1.2.6: some pkg query-format strings miss results existing ports-mgmt/pkg In Progress
187181: sysutils/php5-fileinfo causes PHP and Apache to core dump existing sysutils/php5-fileinfo In Progress
187177: editors/libreoffice: c++: error: unable to execute command: Abort trap existing editors/libreoffice In Progress
187165: sysutils/grub2 10_kfreebsd contains 't' characters that should be TABs existing sysutils/grub2 In Progress
187148: textproc/docbook: docbook ports conflicts with local docbook FreeBSD10 release existing textproc/docbook In Progress
187140: net/remmina cannot connect to rdp existing net/remmina In Progress
187136: New port: irc/irccd a fast and powerful C++ IRC bot new irc/irccd In Progress
187125: x11/xorg: No X Cursor after upgrade from 9.1 to 9.2 existing x11/xorg In Progress
187113: net/siproxd outdated and not functional in a looping config (port update required) existing net/siproxd In Progress
187106: [NEW PORT] games/spigot Minecraft server new games/spigot In Progress
187085: [PATCH] devel/libexecinfo: possibly conflicts with systemwide libexecinfo on 10.x existing devel/libexecinfo In Progress
187034: print/harfbuzz fails to install existing print/harfbuzz In Progress
187030: emulators/virtualbox-ose doesn't compile with X11 option only existing emulators/virtualbox-ose In Progress
187024: databases/redis-devel proper rcvar existing databases/redis-devel In Progress
187010: problem with www/libxul after upgrade to 24.3.0 - external content handling with Conkeror broken existing www/libxul In Progress
187001: Update for misc/fxload existing misc/fxload In Progress
186978: net-p2p/transmission depends on base openssl WITH_OPENSSL_PORT existing net-p2p/transmission In Progress
186973: emulators/virtualbox-ose 4.3.6 vm fails to start with VERR_SYMBOL_NOT_FOUND existing emulators/virtualbox-ose In Progress
186925: error message continually pops up at random times unknown   In Progress
186903: new port: security/krb5-strength new security/krb5-strength In Progress
186879: [PATCH] textproc/rarian: De-bashify existing textproc/rarian In Progress
186832: emulators/virtualbox-ose fails to build existing emulators/virtualbox-ose In Progress
186827: ports-mgmt/pkg pkg-repo(8) includes only oldest version of package existing ports-mgmt/pkg In Progress
186808: emulators/virtualbox-ose VNC option doesn't support port ranges for "Remote Desktop Server Port" in Display, Remote Display existing emulators/virtualbox-ose In Progress
186805: [x11] Excise some vestigial XFree86 references unknown   In Progress
186773: graphics/libfpx: error: cast from pointer to smaller type 'DWORD' existing graphics/libfpx In Progress
186754: New Port: archivers/lua-zlib new archivers/lua-zlib In Progress
186694: net/samba36: samba not work in domain existing net/samba36 In Progress
186661: www/epiphany doesn't compile anymore existing www/epiphany In Progress
186618: [PATCH] www/nginx-devel: recover building with ngx_postgres module existing www/nginx-devel In Progress
186586: editors/libreoffice - outdated port existing editors/libreoffice In Progress
186575: net/samba41: Start of Samba results in "nss_ldap: could not search LDAP server" errors existing net/samba41 In Progress
186563: databases/postgis21: error: use of undeclared identifier 'ICONV_SET_TRANSLITERATE' existing databases/postgis21 Open
186497: ports-mgmt/pkg: local overrides for pkg audit existing ports-mgmt/pkg In Progress
186493: [new port] net-p2p/feathercoin: Virtual Peer-to-Peer Currency Software new net-p2p/feathercoin Open
186488: www/junkbuster listen queue increase to stop sonewconn filling the message log existing www/junkbuster In Progress
186479: irc/anope: port doesn't work existing irc/anope In Progress
186476: audio/wildmidi version 0.3.8 existing audio/wildmidi In Progress
186472: After update using pkg upgrade I cannot install devel/glib20 existing devel/glib20 In Progress
186455: editors/libreoffice crashes with Signal 10 bus error on i386 existing editors/libreoffice In Progress
186454: port net/remmina-plugin-vnc coredumps on FreeBSD 9.1-RELEASE-p10 existing net/remmina-plugin-vnc In Progress
186428: databases/ruby-bdb fails to build existing databases/ruby-bdb In Progress
186396: www/webkit-gtk2 fails to build on sparc64 existing www/webkit-gtk2 In Progress
186395: net/freerdp fails to build on sparc64 existing net/freerdp In Progress
186394: [patch] multimedia/libvpx enable sparc64 existing multimedia/libvpx In Progress
186352: www/chromium 32.0.1700.102 hangs and becomes unresponsive. existing www/chromium In Progress
186316: [NEW PORT] devel/spyder: Scientific PYthon Development EnviRonment new devel/spyder Open
186287: net/samba36: looping detected inside krb5_get_in_tkt on 10.0-RELEASE existing net/samba36 In Progress
186249: [patch] devel/ncurses MANPAGES option existing devel/ncurses In Progress
186244: net/remmina-plugin-rdp: Undefined symbol "gdk_pixbuf_get_from_surface" existing net/remmina-plugin-rdp In Progress
186232: x11-fonts/linux-f10-fontconfig/Makefile add -f to ln so install works existing x11-fonts/linux-f10-fontconfig In Progress
186208: Install of (textproc/libxslt) on FreeBSD 10 without libiconv package existing textproc/libxslt In Progress
186130: math/octave 3.6.4 compiled by clang on FreeBSD 10 amd64, some wrong results existing math/octave In Progress
186114: net/mpd5 hangs after a certain number of users connect existing net/mpd5 In Progress
186093: multimedia/vlc stutters when playing mkv existing multimedia/vlc In Progress
186049: databases/luasql-sqlite3 doesn't honor LUA_VER/WITH_LUA_VER flags existing databases/luasql-sqlite3 In Progress
186045: patch to x11-drivers/xf86-input-mouse to support FlipXY existing x11-drivers/xf86-input-mouse In Progress
186033: graphics/xpdf fails to package with X11 option unset existing graphics/xpdf In Progress
186021: print/cups-pstoraster: master site has gone away existing print/cups-pstoraster In Progress
186011: [PATCH] devel/opengrok: update urls for MASTER_SITES & WWW existing devel/opengrok In Progress
185992: Start using github for graphics/npretty existing graphics/npretty In Progress
185906: databases/slony1v2 -- fix build with poudriere and non-default postgresql version, etc existing databases/slony1v2 In Progress
185884: Miscellaneous ports fixes for Python 3 unknown   Open
185867: [PATCH] devel/binutils: [SUMMARIZE CHANGES] existing devel/binutils In Progress
185850: [PATCH] www/nginx: add support for 3rd party video_thumbextractor module existing www/nginx In Progress
185847: [PATCH] www/nginx-devel: add support for 3rd part video_thumbextractor module existing www/nginx-devel In Progress
185818: Inability to install graphics/ImageMagick-nox11 and lang/execline on the same machine (namespace collision) existing graphics/ImageMagick-nox11 In Progress
185816: Please add 3th party module to www/nginx existing www/nginx In Progress
185800: net/remmina-plugins - multiple install issues existing net/remmina-plugins In Progress
185799: [exp-run] SOCK_RAW framework   In Progress
185751: net-mgmt/p5-FusionInventory-Agent: New upstream release existing net-mgmt/p5-FusionInventory-Agent In Progress
185673: x11/kde4-runtime (4.10.5) will not compile - Documentation Application VAD create fails existing x11/kde4-runtime In Progress
185653: [NEW PORTS] devel/qt4-private-* and devel/qt4-declarative-* new devel/qt4-private In Progress
185613: [UPDATE] accessibility/gnome-speech, add license information existing accessibility/gnome-speech In Progress
185576: ports-mgmt/pkg can't bootstrap from VirtualBox in NAT network existing ports-mgmt/pkg In Progress
185575: [patch] devel/anjuta check autogen fix existing devel/anjuta In Progress
185571: www/varnish: rc.d/varnish doesn't provide a way to specify a secret file. existing www/varnish In Progress
185567: textproc/clucene: pkgconfig file is missing clucene-contribs-lib existing textproc/clucene In Progress
185563: [UPDATE] games/gweled to v0.9.1 existing games/gweled In Progress
185527: [PATCH] security/nss: Added forgotten existing security/nss In Progress
185526: irc/weechat problem after upgrading to ncurses-5.9.20131221 existing irc/weechat In Progress
185488: [patch] net/kdenetwork4: add optional dependency on knemo existing net/kdenetwork4 In Progress
185453: print/tex-luatex compilation fails on sparc64 existing print/tex-luatex In Progress
185375: math/lapack fails to build with PROFILE=on existing math/lapack In Progress
185291: devel/valgrind segfaults with -d parametr existing devel/valgrind In Progress
185252: x11-toolkits/pango can't find fonts existing x11-toolkits/pango In Progress
185217: ports-mgmt/portupgrade: Building ports using a symbolic link in place of /usr/ports is broken existing ports-mgmt/portupgrade In Progress
185210: www/seamonkey-i18n: options sometimes ignored existing www/seamonkey-i18n In Progress
185207: databases/rrdtool fails to install when compiled with ruby support existing databases/rrdtool In Progress
185206: x11-toolkits/py-gtk2 missing dependency with py-gobject existing x11-toolkits/py-gtk2 In Progress
185193: net-mgmt/net-snmp: UCD-SNMP-MIB::memBuffer flapping and getting negative existing net-mgmt/net-snmp In Progress
185164: KDE ports randomly fail to build in the cluster unknown   In Progress
185150: [patch] security/tor: move mirrors to existing security/tor In Progress
185090: [UPDATE] x11/pixman, add license information existing x11/pixman Open
185083: x11-toolkits/vte and bison existing x11-toolkits/vte In Progress
185008: x11/kde4: active window doesn't saved on screen lock existing x11/kde4 In Progress
184996: audio/kmix: incorrect volume levels existing audio/kmix In Progress
184995: x11/kde4: Hibernate option in Exit menu enabled existing x11/kde4 In Progress
184994: x11/xscreensaver doesn't hides mouse pointer existing x11/xscreensaver In Progress
184989: net/freerdp: sound redirection doesn't works existing net/freerdp In Progress
184980: [patch] www/xombrero remove advertisement existing www/xombrero In Progress
184964: [patch] emulators/virtualbox-ose-additions: does not build in poudriere existing emulators/virtualbox-ose-additions In Progress
184961: updated Port lang/p5-ePerl existing lang/p5-ePerl In Progress
184953: ports-mgmt/pkg: pkg updating misses ports/UPDATING entries containing wildcard existing ports-mgmt/pkg In Progress
184922: [NEW PORT] sysutils/storcli: SAS MegaRAID FreeBSD StorCLI new sysutils/storcli Open
184721: [pkgng] www/nginx: purges /var/tmp/nginx on pkg upgrade existing www/nginx In Progress
184687: x11/mate: Mate freeze on "change password" option existing x11/mate In Progress
184673: [] abort when a dependency's ports directory doesn't exist framework   In Progress
184672: portupgrade -p fails to install dependencies with staging existing ports-mgmt/portupgrade In Progress
184646: [PATCH] lang/erlang: tls ecc fix existing lang/erlang In Progress
184632: textproc/sgmlformat: broken regexp -> regex conversion existing textproc/sgmlformat In Progress
184615: x11/mate: mate-file-manager-open-terminal fails to install existing x11/mate In Progress
184592: [PATCH] www/rubygem-unicorn: add rc.d script existing www/rubygem-unicorn In Progress
184545: net/openbgpd: OpenBGPd fails to initiate TCP MD5 sig connexions existing net/openbgpd In Progress
184540: emulators/dolphin-emu: New options framework + DEBUG option set = wrong INSTALL_TARGET existing emulators/dolphin-emu In Progress
184491: net/relayd downloaded to "5.4.20131122?dummy=%2Frelayd-5.4.20131122.tar.gz" instead "relayd-5.4.20131122.tar.gz" existing net/relayd In Progress
184489: make INSTALL_AS_USER=1 check-orphans fails as regular user framework   In Progress
184484: www/nginx-devel: 3rd-party upload module for nginx, nginx-devel build failed (regarding PR 182010) existing www/nginx-devel In Progress
184483: port security/arm: change user/group of 'arm' to _tor:_tor existing security/arm Open
184425: lang/sbcl 1.1.12,1 fails to build with THREADS option existing lang/sbcl In Progress
184379: [patch] misc/compat9x enable sparc64 existing misc/compat9x In Progress
184368: conflicts between cad/qcad and texlive-base existing cad/qcad In Progress
184363: [patch] misc/compat8x enable sparc64 existing misc/compat8x In Progress
184344: www/xpi-pentadactyl update existing www/xpi-pentadactyl In Progress
184331: [patch] misc/compat7x enable sparc64 existing misc/compat7x In Progress
184170: [] fix ports DESTDIR support with FreeBSD 10 make framework   In Progress
184104: x11/xorg: i830 display code hangs during startup existing x11/xorg In Progress
184053: net/openldap24-server: perl_back.h:22:18: error: perl.h: No such file or directory existing net/openldap24-server In Progress
183902: sysutils/cfengine*: build fails with libvirt on i386 existing sysutils/cfengine In Progress
183885: net/samba4: use net/mDNSResponder to provide Zeroconf support existing net/samba4 In Progress
183872: net/samba4 does not need to pull in lang/gcc existing net/samba4 In Progress
183869: [PATCH] devel/ruby-gems : Update to 2.1.7 existing devel/ruby-gems In Progress
183864: ports-mgmt/portlint: feature request existing ports-mgmt/portlint In Progress
183849: [patch] security/py-pycryptopp: unbreak clang build existing security/py-pycryptopp In Progress
183841: www/nginx accept-language module tarball mismatch existing www/nginx In Progress
183802: lang/clang-devel : ccc-analyzer uses gcc/g++ by default existing lang/clang-devel In Progress
183795: lang/pypy fails to work in a virtualenv existing lang/pypy In Progress
183711: New port: deskutils/myrulib E-Book Library Manager new deskutils/myrulib Open
183678: sysutils/fsc does not work anymore existing sysutils/fsc In Progress
183645: www/chromium: segfault in string operations existing www/chromium New
183478: x11-servers/xorg-server: DEVD backend is broken, here's a fix existing x11-servers/xorg-server In Progress
183464: net-p2p/transmission-qt4: crash transmission-qt4 after start existing net-p2p/transmission-qt4 In Progress
183448: www/lighttpd 1.4.33: cannot bind to IPv4 and IPv6 SSL existing www/lighttpd In Progress
183435: x11/xorg: 100% CPU use of xorg using firefox when showing large images (say 20 Mpixel) existing x11/xorg In Progress
183422: deskutils/notification-daemon 0.7.2 asserts on any notification existing deskutils/notification-daemon Open
183379: [] remove "security" check from b.*.m framework   In Progress
183372: [] depreciation of LATEST_LINK conflicts with USE_LDCONFIG framework   In Progress
183285: ports net/samba4 4.0.8 fails to build. Linking error existing net/samba4 In Progress
183051: editors/libreoffice fails on poudriere existing editors/libreoffice In Progress
182969: x11/xorg: Xorg crashes on -configure existing x11/xorg In Progress
182927: LDFLAGS missing in databases/php53-sqlite3 existing databases/php53-sqlite3 Open
182909: Ports should sanitize the environment framework   In Progress
182906: audio/taglib .h files not c++ pedantic clean, breaks audio/soundkonverter (mp4coverart.h:49: error: comma at end of enumerator list) existing audio/taglib In Progress
182846: patch misc/ossp-uuid to prevent postgresql crash existing misc/ossp-uuid In Progress
182657: [patch] lang/gcc48: expose c99 math in 'std' namespace existing lang/gcc48 In Progress
182449: databases/pecl-memcached: Memcached::setSaslAuthData unavailable, by lack of SASL authentication option, existing databases/pecl-memcached Open
182430: [exp-run] removing RCS from the base system framework   In Progress
182420: math/fityk: coredumps on libc++ only systems and compiled with gcc existing math/fityk In Progress
182347: ports-mgmt/pkg: install target does nothing for pkgng + staging + NO_PKG_REGISTER case existing ports-mgmt/pkg In Progress
182346: mail/thunderbird - fails to build with gtk3 existing mail/thunderbird In Progress
182320: emulators/virtualbox-ose-additions will not compile on HEAD existing emulators/virtualbox-ose-additions In Progress
182018: math/cln: xception.h:14:24: error: implicit instantiation of undefined template 'std::__1::basic_string, std::__1::allocator >' : std::runtime_error(std::string()) {} existing math/cln In Progress
182010: [PATCH]: www/nginx, www/nginx-devel fix 3rd party upload module existing www/nginx In Progress
182002: x11-wm/xcompmgr shadow rendering patch existing x11-wm/xcompmgr In Progress
181978: ports-mgmt/pkg: Ports with PKGNG doesn't have a -X equivalent mechanism existing ports-mgmt/pkg In Progress
181799: ports-mgmt/poudriere: [PATCH] allow in-line comments in ports-list existing ports-mgmt/poudriere In Progress
181789: benchmarks/netio 1.32 is available existing benchmarks/netio In Progress
181734: Patch to IPv6+SSL in sysutils/ucspi-tcp existing sysutils/ucspi-tcp Open
181720: [patch] shells/zsh fix building of static binary with devel/ncurses port installed existing shells/zsh In Progress
181696: port dns/samba-nsupdate doesn't link -lgssapi_krb5, won't compile on base krb5 existing dns/samba-nsupdate In Progress
181658: misc/freebsd-doc-en fails to build if the user is running a Korn shell. existing misc/freebsd-doc-en In Progress
181629: [PATCH] sysutils/tracker-client was setting itself at such a low priority it never crawls unknown   In Progress
181592: ports-mgmt/pkg: pkg2ng should check/add WITH_PKGNG=yes to /etc/make.conf existing ports-mgmt/pkg In Progress
181561: net-im/telepathy-idle fails to build in poudriere existing net-im/telepathy-idle In Progress
181393: www/xpi-quick-locale-switcher does not works with firefox-esr-17.0.8,1 existing www/xpi-quick-locale-switcher In Progress
181324: [patch] emulators/virtualbox-ose: fix integration with net/istgt option VBOXVD (VirtualBox virtual hd integration) existing emulators/virtualbox-ose Open
181285: x11/xorg does not start if Nvidia Optimus is enabled on ThinkPad W530 existing x11/xorg In Progress
181278: deskutils/notification-daemon: Notification Daemon dumps core existing deskutils/notification-daemon In Progress
181271: [PATCH] let's makepatch support spaces in filenames framework   In Progress
181266: cannot update net-im/telepathy-glib-0.18.2 to 0.20.2 existing net-im/telepathy-glib In Progress
181244: New port: devel/ocl-icd OpenCL Installable Client Driver new devel/ocl-icd Open
181243: New port: devel/opencl-icd Khronos OpenCL Installable Client Driver new devel/opencl-icd Open
181228: databases/postgresql91-server rc.d script fails to start server existing databases/postgresql91-server In Progress
181095: net-p2p/transmission-gtk fails to start existing net-p2p/transmission-gtk In Progress
181054: graphics/gimp port build fails existing graphics/gimp In Progress
181052: [patch] make lang/lua not hang on thread creation unknown   In Progress
181049: lang/ghc: possible regression existing lang/ghc In Progress
181005: mail/thunderbird - Enigmail failes to start pinentry existing mail/thunderbird In Progress
181004: options: ftp/curl fails to compile out of the box when WITHOUT_GSSAPI specified in the base system existing ftp/curl In Progress
180924: ports-mgmt/poudriere does not write changed port config existing ports-mgmt/poudriere In Progress
180896: sysutils/cfengine35: can't use edit_xml because libxml2 not found existing sysutils/cfengine35 In Progress
180790: devel/linux_kdump prints BSD descriptions of errno names existing devel/linux_kdump In Progress
180723: editors/libreoffice: calc spreadsheet external data link by URL not working existing editors/libreoffice In Progress
180705: [] patching a file with both EXTRA_PATCHES and files/patch-* fails framework   In Progress
180673: ports-mgmt/portmaster: shall not delete build deps that are run deps, too (e.g. math/cantor: fails on R stuff) existing ports-mgmt/portmaster In Progress
180656: ports-mgmt/portmaster: --packages-local=/usr/local/ports/packages shall be the default framework   In Progress
180643: java/openjdk6 build fails on amd64 -current existing java/openjdk6 In Progress
180614: sysutils/xosview crashes after some days on sparc64 existing sysutils/xosview In Progress
180604: devel/xdg-utils: xdg-screensaver depends on dcop existing devel/xdg-utils In Progress
180601: graphics/gegl is missing DOCS option from Makefile existing graphics/gegl In Progress
180596: [patch] devel/libnotify: remove gtk20 and gettext dependencies existing devel/libnotify In Progress
180495: sysutils/doinkd exits upon start up from rc.d scripts existing sysutils/doinkd In Progress
180484: does not support full range of version settings framework   In Progress
180470: r321585 port commit causes Apache 2.2 w/ www/mod_rpaf2 to segfault when IPv6 client accesses site existing www/mod_rpaf2 Open
180459: Port devel/py-dbus ' wrong PORTDOCS logic and pkg-plist break package [patch] existing devel/py-dbus In Progress
180456: multimedia/x264 on ia64: /usr/include/math.h:236: error: expected ')' before '/' token existing multimedia/x264 In Progress
180407: x11/kde4: dolphin in kde-4.10.5 will cause reboot existing x11/kde4 In Progress
180348: devel/dbus fails if existing user found existing devel/dbus In Progress
180336: [PATCH] sysutils/apcupsd: support multiple instances of apcupsd existing sysutils/apcupsd In Progress
180181: [PATCH] databases/postgresql92-server: Add pthread support option existing databases/postgresql92-server In Progress
180171: [new ports] add 6 new ports for Ardour 3.x to work new audio/lv2 In Progress
180122: Building the misc/freebsd-doc-en port fails if w3m is not installed existing misc/freebsd-doc-en In Progress
180114: Error building net-im/loudmouth existing net-im/loudmouth In Progress
180062: graphics/clutter-gtk compilation failure existing graphics/clutter-gtk In Progress
180034: audio/squeezeboxserver is now Logitech Media Server existing audio/squeezeboxserver In Progress
180023: x11/xorg: xorg (WITH_NEW_XORG) on 10-CURRENT i386 crashes or hard lock kernel existing x11/xorg In Progress
179972: Encryption feature for sysutils/synergy-devel 1.4.12 appears to be non-functional. unknown   In Progress
179939: www/gatling does not work with TLS in default installation existing www/gatling In Progress
179551: databases/redis: Add profiles to existing databases/redis Open
179507: devel/kBuild won't compile on current existing devel/kBuild In Progress
179444: www/nginx: Nginx Passenger module doesn't compile existing www/nginx In Progress
179416: net/vnc compiles broken imake tool existing net/vnc In Progress
179400: print/freetype2: Add Infinality patches existing print/freetype2 In Progress
179337: [PATCH] graphics/enblend: Fix docs, mtree, add OptionsNG existing graphics/enblend In Progress
178799: [Patch] Add 3rd party StatsD Module to www/nginx port existing www/nginx In Progress
178762: [patch] Mk/ Store options alphabetically framework   In Progress
178709: [new port]: databases/hyperdex Searchable distributed key-value store new databases/hyperdex In Progress
178699: [fix] devel/xdg-utils fails without ${LOCALBASE}/share/desktop-directories existing devel/xdg-utils In Progress
178601: databases/postgresql92-server: postgresql port has wrong check for MIT_KRB5 existing databases/postgresql92-server In Progress
178533: [PATCH] www/nginx: nginx+3rd syslog support existing www/nginx In Progress
178441: [NEW PORT] databases/memkeys: A tool to show memcache key usage in realtime new databases/memkeys In Progress
178433: editors/libreoffice generates zombie processes after i close the application. existing editors/libreoffice In Progress
178333: [new port] net/libnss-pgsql: allow user accounts to be stored in postgresql new net/libnss-pgsql In Progress
178271: Simplify framework   In Progress
178243: net/asterisk11 makefile missing options existing net/asterisk11 In Progress
178170: [patch] x11-servers/xorg-server: xkb misbehaviour on keyboard layouts switch existing x11-servers/xorg-server In Progress
178128: [UPDATE] www/trac-autocomplete: Update to 0.4.2 & Take maintainership existing www/trac-autocomplete In Progress
178127: [UPDATE] www/trac-datefield: Update to 2.0.0 & Take maintainership existing www/trac-datefield In Progress
178087: [UPDATE] www/trac-defaultcc: Update to 0.3 & Take maintainership existing www/trac-defaultcc In Progress
178072: [PATCH] [] look for Makefile.local in ${PORTSDIR} as well as ${.CURDIR} framework   In Progress
178063: [Patch] graphics/digikam-kde4 can't edit images existing graphics/digikam-kde4 In Progress
177786: net/samba36 net/samba-nmblookup multimedia/xbmc conflics existing net/samba36 In Progress
177785: security/ipsec-tools: ipsec-tools 0.8.0 racoon tends to segfault when multiple Phase1's aren't establishing existing security/ipsec-tools In Progress
177741: net-mgmt/sipcalc cannot handle ipv6 zone index existing net-mgmt/sipcalc In Progress
177677: /usr/local/bin/grep halts databases/postgresql84-server configuration existing databases/postgresql84-server In Progress
177497: mail/dovecot startup script breaks onestart functionality existing mail/dovecot Open
177458: devel/gobject-introspection coredumping things existing devel/gobject-introspection In Progress
177375: devel/pcre segmentation fault executing match() existing devel/pcre In Progress
177365: [patch] ports-mgmt/portupgrade-devel enhancements existing ports-mgmt/portupgrade-devel In Progress
177288: x11-fm/krusader2 missing minimize icon in windowmaker desktop existing x11-fm/krusader2 In Progress
177226: devel/glib20 update: gnome-gmail-notifier won't start and nautilus eats cpu existing devel/glib20 In Progress
177202: [PATCH] emulators/virtualbox-ose option to skip building kernel module existing emulators/virtualbox-ose In Progress
177059: devel/cmake: /usr/share/cmake/Modules/FindLibXml2.cmake should include ${LOCAL_BASE}/include in LIBXML2_INCLUDE_DIR existing devel/cmake In Progress
177018: Can't build devel/xsd existing devel/xsd In Progress
176984: misc/dahdi-kmod: FreeBSD crashes periodically with RedFone FB2 and dahdi_dynamic_ethmf driver existing misc/dahdi-kmod In Progress
176969: audio/sdl_sound: fix depend existing audio/sdl_sound In Progress
176968: audio/sdl_mixer: fix depends existing audio/sdl_mixer In Progress
176925: ports-mgmt/pkg: pkg version fails if cwd no longer exists existing ports-mgmt/pkg In Progress
176869: x11/kde4: klauncher crash while attaching virtual cdrom to VirtualBox existing x11/kde4 In Progress
176862: [request] x11/kde4: supply debug libs for KDE binary pkgs existing x11/kde4 In Progress
176758: [patch] databases/tdb: samba talloc + tdb incorrect w/ non-default LOCALBASE existing databases/tdb In Progress
176703: graphics/dri : Fix complitation (not useability) on ARM existing graphics/dri In Progress
176382: ports dependencies not being recorded framework   In Progress
176359: www/mediawiki required sqlite3, not sqlite for PHP_VER 52+ existing www/mediawiki119 In Progress
176358: /net/freebsd-tftp Incorrect TFTP Behavior with Secondary IP Address existing net/freebsd-tftp In Progress
176326: french/aster does not build on amd64/clang or ia64/gcc existing french/aster In Progress
176196: [PATCH] games/quake2-ctf: Set NO_WRKSUBDIR and BUILD_WRKSRC instead of abusing WRKSRC. existing games/quake2-ctf In Progress
176085: When I play a video with multimedia/mplayer2, and go back to Firefox, Xorg closes existing multimedia/mplayer2 In Progress
176000: textproc/clucene: Incomplete install if WRKDIRPREFIX contains loopback symlink existing textproc/clucene In Progress
175775: www/lighttpd: libev excludes freebsd-kqueue existing www/lighttpd In Progress
175747: [patch][]: activate DEBUG framework   In Progress
175561: [patch] [] Enhancement to avoid pkgng "/bin/sh: Argument list too long" framework   In Progress
175402: math/suitesparse: undefined reference to `SuiteSparse_time` existing math/suitesparse In Progress
175300: java/jamvm fails to compile on ARM6 (raspberry-pi) existing java/jamvm In Progress
175288: emulators/virtualbox-ose: FreeBSD VirtualBox guest unable to execute command issued by Linux host using VBoxManage existing emulators/virtualbox-ose In Progress
175221: emulators/virtualbox-ose: Cannot Resume VirtualBox VMs Via VBoxHeadless existing emulators/virtualbox-ose In Progress
175087: [PATCH] lang/ghc: build fails if dblatex is installed existing lang/ghc In Progress
174975: Latest emulators/virtualbox-ose-kmod 4.2.6 commit (309876) breaks VLAN tagging existing emulators/virtualbox-ose-kmod In Progress
174960: sysutils/fusefs-ntfs mkntfs fails because of "no block device" existing sysutils/fusefs-ntfs In Progress
174825: java/openjdk6: fails to build on i386 (64-bit mode not compiled in) existing java/openjdk6 In Progress
174768: x11-wm/xfce4-panel starts in properies edit state existing x11-wm/xfce4-panel In Progress
174729: ports-mgmt/portmaster: should check for script running as before doing certain operations existing ports-mgmt/portmaster In Progress
174533: net/openbgpd doesn't reload after config error (previous reload still running) existing net/openbgpd In Progress
174288: www/squidclamav: A is not made and a location of squidclamav.conf is /etc. existing www/squidclamav In Progress
174232: Error message after updating some Perl modules with net/sendemail existing net/sendemail In Progress
174020: initdb will not run on a mounted FS with a snapshot directory unknown   In Progress
173925: emulators/virtualbox-ose-additions 4.1.22 VBoxService shutdown without core dump existing emulators/virtualbox-ose-additions Open
173889: [NEW PORT] www/kannel-sqlbox: SQL interface for Kannel new www/kannel-sqlbox Open
173731: [] Doesn't clean dependency directory if not installed or call reinstall; results in build failure later framework   In Progress
173729: databases/postgresql92-server is confused by PREFIX existing databases/postgresql92-server Open
173672: emulators/virtualbox-ose: VirtualBox and bridge problem. existing emulators/virtualbox-ose In Progress
173620: [] Recovery of the functionality of CONFLICTS among ports with different default PREFIXs, ex., between KDE4 and others framework   In Progress
173603: java/icedtea-web starts javaws incorrectly existing java/icedtea-web In Progress
173590: New ports: textproc/fcitx-m17n and vietnamese/fcitx-unikey, libm17n and unikey support for Fcitx new textproc/fcitx-m17n In Progress
173533: net/mpd5 PPTP server race condition with some clients existing net/mpd5 In Progress
173318: assumes UID_FILES has 10 columns framework   In Progress
173097: [patch] editors/xmlcopyeditor XML parser option existing editors/xmlcopyeditor In Progress
172967: [new port] revive port www/asterisk-gui for asterisk 1.6 to asterisk 11 new www/asterisk-gui In Progress
172964: [] USE_GITHUB feature not fully implemented framework   In Progress
172948: print/ghostscript9 fails to compile with some options off existing print/ghostscript9 In Progress
172741: [] check-build-conflicts checks too early for pre-build targets framework   In Progress
172366: [UPDATE] multimedia/pitivi to 0.15.2 existing multimedia/pitivi In Progress
172359: [PATCH] editors/calligra: Fix build with clang++ -stdlib=libc++ -std=c++11 existing editors/calligra In Progress
172275: [PATCH] [exp-run] devel/libtool: avoid use of -nostdlib for linking existing devel/libtool In Progress
172183: emulators/virtio-kmod : Severe filesystem corruption when running as KVM guest with VirtIO enabled existing emulators/virtio-kmod In Progress
172168: [new port] comms/libdlo: the basis for the DisplayPort xorg driver new comms/libdlo In Progress
172110: databases/postgresql9[2,3,4]-server change periodic script [patch] unknown   Open
171914: New port: devel/pocl: Portable open source OpenCL 1.2 implementation new devel/pocl In Progress
171852: [PATCH] databases/mysql55-server: add support for multiple instances (profiles) existing databases/mysql55-server In Progress
171793: lang/perl5.16 w/ POD complains of old groff version existing lang/perl5.16 In Progress
171640: New port: devel/libivykis Asynchronous I/O readiness notification library new devel/libivykis Open
171621: [PATCH]; allow Real Names in MAINTAINER lines framework   In Progress
171450: [update] devel/ding-libs to 0.2.91 existing devel/ding-libs In Progress
171426: multimedia/cuse4bsd-kmod now breaks rebuild of kmods during kernel or installkernel build existing multimedia/cuse4bsd-kmod In Progress
171372: [PATCH] databases/redis: rc script with multiple profiles support existing databases/redis In Progress
171367: security/py-PF gives IOError: [Errno 13] Permission denied while trying to get_ruleset existing security/py-PF In Progress
171361: ports-mgmt/pkg: Regressions from pkg_ tools existing ports-mgmt/pkg In Progress
171353: Segmentation fault when use'ing the perl modules XML::LibXML and GD together (related to pthreads?) unknown   In Progress
171338: both databases/mariadb-scripts and databases/mariadb-server install /usr/local/bin/mysqld_multi existing databases/mariadb-scripts In Progress
171313: both archivers/freeze 2.5_2 and multimedia/mlt 0.8.0_1 install /usr/local/bin/melt existing archivers/freeze In Progress
171246: lang/python27: make python curses module work with unicode existing lang/python27 In Progress
170943: [PATCH] build mail/spamass-milter with sendmail-sasl existing mail/spamass-milter In Progress
170852: [PATCH] x11-fonts/encodings: encodings.dir includes bogus entries existing x11-fonts/encodings In Progress
170788: lang/python27: PyQT applications crash Python 2.7 (core dump) existing lang/python27 In Progress
170690: x11-servers/xorg-server eats memory existing x11-servers/xorg-server In Progress
170652: New port: net-mgmt/nagios-check_ipmi_sensor: Nagios/Icinga plugin to check IPMI sensors new net-mgmt/nagios-check_ipmi_sensor In Progress
170524: devel/ding-libs fails to build in tinderbox existing devel/ding-libs In Progress
170508: [PATCH] multimedia/libv4l: Don't link to -lpthread existing multimedia/libv4l In Progress
170466: Under KDE4 4.8.4 System Settings - Desktop Effects Open GL rendering selection does not hold through reboot. unknown   In Progress
170410: devel/gvfs: gvfs-hal-volume-monitor crashes when new media with invalid encoding characters are plugged in. existing devel/gvfs In Progress
170316: Mk/ add compatibility for PORTDATA for optionsNG framework   In Progress
170299: sysutils/syslog-ng sample config does not work the way it claims to existing sysutils/syslog-ng In Progress
170289: [patch] use one version for x11/nvidia-driver x11/nvidia-xconfig x11/nvidia-settings existing x11/nvidia-driver In Progress
170179: [PATCH] www/rubygem-passenger: Allow both nginx and apache22 existing www/rubygem-passenger In Progress
170107: net/olsrd fails to build with -DWITH_MULTI_IF existing net/olsrd In Progress
170104: error setting source interface in net/mcast-tools, net/mrouted existing net/mcast-tools In Progress
169986: security/mcrypt does not encrypt or decrypt properly in some cases existing security/mcrypt Open
169794: x11/xdm, several /usr/local/lib/X11/xdm/ files missing from pkg info -xl output existing x11/xdm In Progress
169636: regexp problem in databases/pgpool-II existing databases/pgpool-II In Progress
169610: sysutils/fusefs-encfs version 1.7.4_1 causing kernel panic and reboot existing sysutils/fusefs-encfs In Progress
169491: [PATCH] math/igraph: update to 0.6 existing math/igraph In Progress
169394: [ ] improper evaluation of config-recursive target framework   In Progress
169300: [PATCH] Allow deinstall as user and make clean after non-root install framework   In Progress
168965: sysutils/syslog-ng installs 2 full blown scripting languages existing sysutils/syslog-ng In Progress
168640: Mk/Uses/ Prevent checksum mismatches for compiled python files on installing python ports via the ports tree unknown   In Progress
168629: games/quakeforge: update to 0.6.2 existing games/quakeforge Open
168504: mysqlcheck (databases/mysql51-client) does not obscure password on command line existing databases/mysql51-client In Progress
168091: Mk/ error: USE_FIREFOX doesn't work correctly framework   In Progress
167794: [patch] Mk/ fix .zip in PATCHFILES framework   In Progress
167627: math/octave: Old lapack causes failure in octave svd() existing math/octave In Progress
167282: net/nss_ldap performance change causes functionality regression existing net/nss_ldap In Progress
167229: [patch] x11/nvidia-settings: install sample tools (optionally) existing x11/nvidia-settings In Progress
167199: x11-fm/nautilus Gnome2.32 Doesn't auto mount sd cards existing x11-fm/nautilus Open
166645: emulators/virtio-kmod: rxcsum breaks checksum for local linux hosts IPv6 TCP existing emulators/virtio-kmod In Progress
166188: [PATCH] ports/Makefile use documented sort syntax framework   In Progress
166163: graphics/dri: gthumb port crashes (SIGSEGV) within the Mesa/DRI library existing graphics/dri In Progress
165936: net-im/ejabberd fails when starting odbc. existing net-im/ejabberd In Progress
165685: x11-wm/xfce4 - excessive replication of menu items existing x11-wm/xfce4 In Progress
165642: x11/kde4: keeps locking the screen. existing x11/kde4 Open
165623: Mk/ et al -- conflicting uses of ${FILE} framework   In Progress
165450: [patch] Mk/ COPYTREE_* macro enhancements framework   In Progress
165422: security/cyrus-sasl2-saslauthd: saslauthd 2.1.25 coredumps at Sendmail AUTH existing security/cyrus-sasl2-saslauthd In Progress
165419: [patch] Mk/ "make showconfig" to tell whether option values are same as the default framework   In Progress
165366: misc/amanda-server: amrecover showing duplicate directories existing misc/amanda-server Open
165360: net-im/ejabberd: ejabberdctl fails to communicate with ejabberd process existing net-im/ejabberd In Progress
165213: devel/cmake: Reinplacement of paths in Modules is bad existing devel/cmake Open
164941: [UPDATE] [NEW PORTS] java/classpath-initial, including rework of java/classpath existing java/classpath In Progress
164896: [exp-run] add support for testing perl modules framework   In Progress
164638: [] [patch] architecture and OS version dependent port building framework   In Progress
164423: [] [patch] Pass MAKE_ENV to recursive make invocations framework   In Progress
164390: [] make package-recursive fails with noise framework   In Progress
164345: Mk/ framework not suitable for linuxulator ports framework   In Progress
164293: print/cups-pstoraster failed existing print/cups-pstoraster In Progress
164242: net/openafs port breaks with KERNCONFDIR and include existing net/openafs In Progress
164010: [patch] net/samba36: Split up samba scripts into more manageable pieces existing net/samba36 Open
163963: Mk/, math/spooles-mpich, science/mpqc-mpich -- trailing slashes and MASTER_PORT framework   In Progress
163749: devel/avrdude fails to reset RTS/DTR properly for Arduino Uno in 8-STABLE/amd64 existing devel/avrdude In Progress
163511: [PATCH] Allow existing users on system to be used by ports framework   In Progress
163323: x11/rxvt-unicode fails to build with perl-5.12.4_3 and p5-ExtUtils-* existing x11/rxvt-unicode In Progress
162924: [] [patch] report more information at port/pkg installation framework   In Progress
162780: editors/libreoffice without GUI existing editors/libreoffice In Progress
162721: [PATCH] config target should complain if TERM not listed in termcap framework   In Progress
161765: net/relayd: relayd fails to initialize on systems without IPv6 in kernel existing net/relayd In Progress
161578: devel/strace is not working existing devel/strace In Progress
161574: Can't compile devel/p5-Locale-gettext on 9.0beta existing devel/p5-Locale-gettext In Progress
161278: net/dante: getoutaddr(): address [...] selected, but not set for external interface existing net/dante In Progress
161044: devel/icu does not build on arm existing devel/icu In Progress
160963: [patch] x11/bigreqsproto: disable specs existing x11/bigreqsproto In Progress
160387: security/ca_root_nss: Allow user to trust extra local certificates existing security/ca_root_nss In Progress
160010: [patch] Mk/ cleanup orig files in post-patch-script target framework   In Progress
159946: [PATCH] [] Add support for make search license= framework   In Progress
159807: RC file for net/mrouted causes kernel panic by running before devd is up. existing net/mrouted In Progress
159787: java/openjdk6 nio muti-thread bug existing java/openjdk6 Open
159398: security/openssl: openssl slapd tls init def ctx failed: -1 existing security/openssl In Progress
158936: [] Add a filename field to DESKTOP_ENTRIES framework   In Progress
157887: [UPDATE] sysutils/ccd2iso update and change maintainer request existing sysutils/ccd2iso Open
157554: www/apache22: Apache RLimitNPROC does not work as intended because Kernel counts process differently existing www/apache22 In Progress
157546: [PATCH] Add feature to Warn on deinstall about groups created by port framework   In Progress
157544: Updates for databases/linux-oracle-instantclient-* existing databases/linux-oracle-instantclient-basic In Progress
157392: sysutils/cdrtools can't burn DVDs correctly existing sysutils/cdrtools In Progress
156405: x11-drivers/xf86-video-ati driver: no hardware rendering existing x11-drivers/xf86-video-ati In Progress
155593: audio/musicpd .16.1 ignores embedded cue sheets in FLAC files with or without libcue installed existing audio/musicpd In Progress
155546: devel/libtool doesn't work properly if not using built in compiler existing devel/libtool In Progress
155201: [PATCH] fix portion of CONFIGURE_ENV added WITH_BINUTILS framework   In Progress
154770: [patch][regression] Mk/ do-fetch fails on ftp:// transfers with ftp(1) fallback framework   In Progress
154502: x11/xdm authorization failure when used with E17 window manager existing x11/xdm In Progress
154086: libsicui18n.a in devel/icu constains no symbols existing devel/icu In Progress
153541: [patch] devel/git: respect STRIP for stripping existing devel/git In Progress
152899: devel/valgrind: unhandled syscall: 506 existing devel/valgrind In Progress
152877: [] Patch to add locking to ports make operations framework   In Progress
152847: devel/buildbot-slave: Add a startup script existing devel/buildbot-slave Open
152804: [patch] Add USE_SRC and ONLY_FOR_*VER to framework   In Progress
152355: net/openbgpd stops syslogging after syslogd restart existing net/openbgpd In Progress
151472: mail/cyrus-imapd23 failed to compile existing mail/cyrus-imapd23 In Progress
151124: net/openbgpd: OpenBGPD exists if an interface is removed or created existing net/openbgpd In Progress
150691: [patch] Templates/BSD.local.dist: add conf.{avail,d} fontconfig directories framework   In Progress
150265: [patch] print/ghostscript8 disable bogus port conflicts in make release existing print/ghostscript8 In Progress
148879: [patch] Mk/ extend IA32_BINARY_PORT to support USE_LINUX framework   In Progress
148727: editors/emacs: devel/cedet Autoloading failed to define function semantic-mode existing editors/emacs In Progress
148695: [] [patch] Easier / automatic regression-test target for ports framework   In Progress
148441: [New Port] devel/py-daemon Well-behaved daemon framework for Python new devel/py-daemon In Progress
148096: emulators/linux_base-* can not be built from ports on amd64 unknown   In Progress
147897: net/openbgpd: Openbgp nexthop invalid after em0 resetting existing net/openbgpd In Progress
147554: new ports: audio/linux-f10-[alsa|pulseaudio] new audio/linux-f10-alsa In Progress
146895: [NEW PORT] emulators/linux-libusb -- linux(4)-friendly libusb new emulators/linux-libusb In Progress
146816: [patch] Mk/ loosen SU_CMD & su(1) cohesion for make {,rm}config framework   In Progress
145301: [patch] sysutils/hal: /usr/local/etc/rc.d/hald startup delay problem existing sysutils/hal In Progress
144533: [] ports tree Makefiles fail to setup a standardardized ENV framework   In Progress
144120: java/openjdk6: games/pcgen doesn't fully work with openjdks existing java/openjdk6 In Progress
141641: [] [patch] make 'config-recursive' finish in one pass framework   In Progress
140621: Add support for /etc/cron.d and /usr/local/etc/cron.d in sysutils/isc-cron port existing sysutils/isc-cron In Progress
140542: sysutils/isc-cron should be compatible with cron from base existing sysutils/isc-cron In Progress
137620: [NEW PORT] devel/p6-perl6-toys new devel/p6-perl6-toys In Progress
135569: `check-sanity` not documented in framework   In Progress
135221: [] unified support for LINUX_OSRELEASE dependency framework   In Progress
133771: print/ghostscript8: Ghostscript8-8.64 port not installing - missing 'ert' existing print/ghostscript8 In Progress
132783: ports/Mk/ ${ARCH} misuse for "--build" option of GNU configure framework   In Progress
132576: net/openldap24-server: multipying LDAP trees on the single server is impossible existing net/openldap24-server In Progress
128972: Port security/krb5 has a linking problem when compiled against base openssl existing security/krb5 In Progress
127889: ports-mgmt/portupgrade detects spurious failures and skips ports unnecessarily existing ports-mgmt/portupgrade In Progress
125183: www/apache22 wrong SUEXEC_DOCROOT existing www/apache22 In Progress
125012: problems in math/ldouble for 128bit long double on i386 existing math/ldouble In Progress
124765: sysutils/gkrellm2 shows wrong number of users in proc display existing sysutils/gkrellm2 In Progress
123570: audio/cpige version 1.5 coredumps if new .conf entries arent defined existing audio/cpige In Progress
122524: www/links1 uses 7-bit us-ascii codepage only when using "-dump" existing www/links1 In Progress
120101: security/krb5 utilities link against wrong libcom_err existing security/krb5 In Progress
115957: Questionable ownership and security on mail/dspam existing mail/dspam In Progress
114725: - No dependencies in the package if there are bsdpan-* ports installed(or others with no origin) framework   In Progress
112745: Add a package-smart target framework   In Progress
111399: print/ghostscript8 (was ghostscript-gpl): WITH_FT_BRIDGE is defective existing print/ghostscript8 In Progress
109580: [patch] math/gnuplot does not include when emacs is installed existing math/gnuplot In Progress
108153: ports extraction with package uid/gid and quota problems framework   In Progress
106616: Default file modes set incorrect for non-root port installs framework   In Progress
106483: [patch] embed distfile information in +CONTENTS framework   In Progress
94935: security/aide: propose an AIDE_CONF knob for make.conf to define the config file location existing security/aide In Progress
82661: [patch] Add support to filter MASTER_SITES and PATCH_SITES by protocol in framework   In Progress
75464: [patch] install default configuration files framework   In Progress
66566: [PATCH] fix build when /usr/obj/usr/ports exists framework   In Progress
66342: [PATCH] fix ECHO_MSG breakage in java ports framework   In Progress
total: 1766


Clicking on each column heading will cause the report to be redone sorted by that column. Clicking again will reverse the sort. The subheadings with date stamps include links to the index of errorlogs for that build environment.

The portname column includes links to a more complete overview for that port.

The PRs (if any) for the given port are listed numerically in the Problem Reports column. Thus, for each port, they should also be in order from earliest to latest.

The underlying technology of this report relies on trying to extract information from the existing PR database entries. These entries are entered by human users using the send-pr command. As such, the quality of the entries varies greatly.

The fastest, and easiest, information is gleaned from a PR entry whose subject line contains the port category and port name, separated by a slash. However, if this algorithm only flagged those, it would miss nearly 50% of the ports PRs, not to mention all the 'framework' PRs.

So, as an extension, various heuristics are used to guess what it is the user really intended. See the code in for the gory details. What's important to understand is this: there is no possible algorithm that will correctly identify all the ambiguous PRs without getting a few false identifications and still run in less than geological time. So, before you are tempted to file a PR on this algorithm itself, read the code to understand its design tradeoffs, and then consider instead filing followup PRs to the ambiguous PRs that would disambiguate them instead. Thanks -- the author.